id_mutation,date_mutation,numero_disposition,nature_mutation,valeur_fonciere,adresse_numero,adresse_suffixe,adresse_nom_voie,adresse_code_voie,code_postal,code_commune,nom_commune,code_departement,ancien_code_commune,ancien_nom_commune,id_parcelle,ancien_id_parcelle,numero_volume,lot1_numero,lot1_surface_carrez,lot2_numero,lot2_surface_carrez,lot3_numero,lot3_surface_carrez,lot4_numero,lot4_surface_carrez,lot5_numero,lot5_surface_carrez,nombre_lots,code_type_local,type_local,surface_reelle_bati,nombre_pieces_principales,code_nature_culture,nature_culture,code_nature_culture_speciale,nature_culture_speciale,surface_terrain,longitude,latitude
2023-192504,2023-01-04,000001,Vente,3027290,21,,RUE JEAN HENRY - LAINE,1000,17630,17161,La Flotte,17,,,17161000AC0042,,,,,,,,,,,,,0,,,,,S,sols,,,93,-1.320566,46.186621
2023-192504,2023-01-04,000001,Vente,3027290,21,,RUE JEAN HENRY - LAINE,1000,17630,17161,La Flotte,17,,,17161000AC0042,,,,,,,,,,,,,0,,,,,J,jardins,,,2830,-1.320566,46.186621
2023-192504,2023-01-04,000001,Vente,3027290,26,,AV DE LA PLAGE,1340,17630,17161,La Flotte,17,,,17161000AC0043,,,,,,,,,,,,,0,3,Dépendance,,0,S,sols,,,640,-1.32005,46.186696
2023-192504,2023-01-04,000001,Vente,3027290,26,,AV DE LA PLAGE,1340,17630,17161,La Flotte,17,,,17161000AC0043,,,,,,,,,,,,,0,1,Maison,113,5,S,sols,,,640,-1.32005,46.186696
2023-192504,2023-01-04,000001,Vente,3027290,26,,AV DE LA PLAGE,1340,17630,17161,La Flotte,17,,,17161000AC0043,,,,,,,,,,,,,0,3,Dépendance,,0,S,sols,,,640,-1.32005,46.186696
2023-192632,2023-01-19,000001,Vente,514500,4,T,RUE DE L AIRMORIN,0005,17630,17161,La Flotte,17,,,17161000AC0337,,,,,,,,,,,,,0,1,Maison,65,1,S,sols,,,152,-1.326698,46.184972
2023-192989,2023-01-25,000001,Vente,882000,1,,RUE DES PELLETANTES,1278,17630,17161,La Flotte,17,,,17161000AL0264,,,,,,,,,,,,,0,1,Maison,18,1,S,sols,,,618,-1.336843,46.189737
2023-192989,2023-01-25,000001,Vente,882000,1,,RUE DES PELLETANTES,1278,17630,17161,La Flotte,17,,,17161000AL0264,,,,,,,,,,,,,0,1,Maison,90,3,S,sols,,,618,-1.336843,46.189737
2023-193035,2023-02-01,000001,Vente,2600000,13,,RUE DE LA SERPENT,1690,17630,17161,La Flotte,17,,,17161000AA0239,,,,,,,,,,,,,0,3,Dépendance,,0,S,sols,,,555,-1.334547,46.194046
2023-193035,2023-02-01,000001,Vente,2600000,13,,RUE DE LA SERPENT,1690,17630,17161,La Flotte,17,,,17161000AA0239,,,,,,,,,,,,,0,1,Maison,330,8,AG,terrains d'agrément,,,363,-1.334547,46.194046
2023-193035,2023-02-01,000001,Vente,2600000,13,,RUE DE LA SERPENT,1690,17630,17161,La Flotte,17,,,17161000AA0239,,,,,,,,,,,,,0,3,Dépendance,,0,AG,terrains d'agrément,,,363,-1.334547,46.194046
2023-193035,2023-02-01,000001,Vente,2600000,13,,RUE DE LA SERPENT,1690,17630,17161,La Flotte,17,,,17161000AA0239,,,,,,,,,,,,,0,3,Dépendance,,0,S,sols,,,555,-1.334547,46.194046
2023-193035,2023-02-01,000001,Vente,2600000,13,,RUE DE LA SERPENT,1690,17630,17161,La Flotte,17,,,17161000AA0239,,,,,,,,,,,,,0,3,Dépendance,,0,AG,terrains d'agrément,,,363,-1.334547,46.194046
2023-193035,2023-02-01,000001,Vente,2600000,13,,RUE DE LA SERPENT,1690,17630,17161,La Flotte,17,,,17161000AA0239,,,,,,,,,,,,,0,3,Dépendance,,0,AG,terrains d'agrément,,,363,-1.334547,46.194046
2023-193035,2023-02-01,000001,Vente,2600000,13,,RUE DE LA SERPENT,1690,17630,17161,La Flotte,17,,,17161000AA0239,,,,,,,,,,,,,0,1,Maison,330,8,S,sols,,,555,-1.334547,46.194046
2023-193035,2023-02-01,000001,Vente,2600000,13,,RUE DE LA SERPENT,1690,17630,17161,La Flotte,17,,,17161000AA0239,,,,,,,,,,,,,0,3,Dépendance,,0,S,sols,,,555,-1.334547,46.194046
2023-193035,2023-02-01,000001,Vente,2600000,,,LA MALADRIE,B102,17630,17161,La Flotte,17,,,17161000AA0240,,,,,,,,,,,,,0,,,,,S,sols,,,65,-1.334761,46.193969
2023-193035,2023-02-01,000001,Vente,2600000,13,,RUE DE LA SERPENT,1690,17630,17161,La Flotte,17,,,17161000AA0242,,,,,,,,,,,,,0,,,,,AG,terrains d'agrément,,,276,-1.334506,46.193936
2023-193035,2023-02-01,000001,Vente,2600000,13,,RUE DE LA SERPENT,1690,17630,17161,La Flotte,17,,,17161000AA0242,,,,,,,,,,,,,0,,,,,S,sols,,,549,-1.334506,46.193936
2023-193035,2023-02-01,000001,Vente,2600000,13,,RUE DE LA SERPENT,1690,17630,17161,La Flotte,17,,,17161000AA0244,,,,,,,,,,,,,0,,,,,S,sols,,,76,-1.334621,46.193776
2023-193038,2023-01-20,000001,Vente,8042.12,,,AUX DOUZE,B058,17630,17161,La Flotte,17,,,17161000ZH0022,,,,,,,,,,,,,0,,,,,T,terres,,,6910,-1.34617,46.195105
2023-193097,2023-01-23,000001,Vente,1305.4,,,LE FONT DE LA RIGLIN,B070,17630,17161,La Flotte,17,,,17161000ZI0071,,,,,,,,,,,,,0,,,,,T,terres,,,1220,-1.340851,46.191141
2023-193617,2023-02-13,000001,Vente,395.9,,,LES COULMIERES,B046,17630,17161,La Flotte,17,,,171610000B0003,,,,,,,,,,,,,0,,,,,L,landes,FOUG,Fougeraie,370,-1.302504,46.177701
2023-193679,2023-02-15,000001,Vente,164000,1,,RUE DU MARCHE,1080,17630,17161,La Flotte,17,,,17161000AB0288,,,7,,,,,,,,,,1,2,Appartement,24,1,,,,,,-1.325926,46.18711
2023-193915,2023-02-21,000001,Vente,470000,15,,RUE DU PUITS DE FER,1410,17630,17161,La Flotte,17,,,17161000AH0544,,,,,,,,,,,,,0,1,Maison,99,3,S,sols,,,75,-1.322727,46.183149
2023-193915,2023-02-21,000001,Vente,470000,15,,RUE DU PUITS DE FER,1410,17630,17161,La Flotte,17,,,17161000AH0546,,,,,,,,,,,,,0,,,,,AB,terrains a bâtir,,,168,-1.32262,46.183171
2023-193937,2023-02-28,000001,Vente,2050000,61,,RTE DE SAINT MARTIN,1521,17630,17161,La Flotte,17,,,17161000AL0014,,,,,,,,,,,,,0,3,Dépendance,,0,J,jardins,,,784,-1.337804,46.191713
2023-193937,2023-02-28,000001,Vente,2050000,61,,RTE DE SAINT MARTIN,1521,17630,17161,La Flotte,17,,,17161000AL0014,,,,,,,,,,,,,0,1,Maison,220,7,S,sols,,,795,-1.337804,46.191713
2023-193937,2023-02-28,000001,Vente,2050000,61,,RTE DE SAINT MARTIN,1521,17630,17161,La Flotte,17,,,17161000AL0014,,,,,,,,,,,,,0,3,Dépendance,,0,S,sols,,,795,-1.337804,46.191713
2023-193937,2023-02-28,000001,Vente,2050000,61,,RTE DE SAINT MARTIN,1521,17630,17161,La Flotte,17,,,17161000AL0014,,,,,,,,,,,,,0,1,Maison,220,7,J,jardins,,,784,-1.337804,46.191713
2023-194071,2023-02-24,000001,Vente,481.5,,,LES CAILLOTIERES OUEST,B030,17630,17161,La Flotte,17,,,17161000ZR0081,,,,,,,,,,,,,0,,,,,AG,terrains d'agrément,,,450,-1.325085,46.178954
2023-194073,2023-02-24,000001,Vente,638.79,,,LES COULMIERES,B046,17630,17161,La Flotte,17,,,171610000B0009,,,,,,,,,,,,,0,,,,,BR,futaies résineuses,,,597,-1.301992,46.178158
2023-194308,2023-02-28,000001,Vente,481.5,,,LES PETITS MARCHAIS,B126,17630,17161,La Flotte,17,,,171610000B0342,,,,,,,,,,,,,0,,,,,T,terres,,,450,-1.298412,46.178187
2023-194316,2023-02-28,000001,Vente,12224.75,,,LES PETITS MARCHAIS,B126,17630,17161,La Flotte,17,,,171610000B0351,,,,,,,,,,,,,0,,,,,L,landes,FOUG,Fougeraie,680,-1.297658,46.178362
2023-194316,2023-02-28,000001,Vente,12224.75,,,LES COURNAUX,B049,17630,17161,La Flotte,17,,,17161000ZC0063,,,,,,,,,,,,,0,,,,,BT,taillis simples,,,1295,-1.315374,46.16944
2023-194316,2023-02-28,000001,Vente,12224.75,,,LES CAILLOTIERES OUEST,B030,17630,17161,La Flotte,17,,,17161000ZR0069,,,,,,,,,,,,,0,,,,,T,terres,,,2640,-1.325226,46.177234
2023-194316,2023-02-28,000001,Vente,12224.75,,,LE CHIRON DES CAILLAISES,B039,17630,17161,La Flotte,17,,,17161000ZT0067,,,,,,,,,,,,,0,,,,,T,terres,,,1500,-1.317154,46.172841
2023-194316,2023-02-28,000001,Vente,12224.75,,,CULQUOILE NORD,B052,17630,17161,La Flotte,17,,,17161000ZV0046,,,,,,,,,,,,,0,,,,,T,terres,,,2310,-1.318242,46.180226
2023-194316,2023-02-28,000001,Vente,12224.75,,,LA MARE,B105,17630,17161,La Flotte,17,,,17161000ZW0131,,,,,,,,,,,,,0,,,,,T,terres,,,3000,-1.313032,46.178221
2023-194449,2023-03-10,000001,Vente,1407000,17,,RUE DU FOND DE COQUEREAU,0658,17630,17161,La Flotte,17,,,17161000AL0107,,,,,,,,,,,,,0,1,Maison,163,4,S,sols,,,426,-1.337462,46.190476
2023-194559,2023-02-28,000001,Vente,1050607,2,,RUE DU TEMPLE,1740,17630,17161,La Flotte,17,,,17161000AC1216,,,,,,,,,,,,,0,1,Maison,123,5,S,sols,,,211,-1.325092,46.18561
2023-194654,2023-03-14,000001,Vente,580000,44,,AV DE LA PLAGE,1340,17630,17161,La Flotte,17,,,17161000AD0026,,,9,,,,,,,,,,1,4,Local industriel. commercial ou assimilé,74,0,,,,,,-1.316988,46.186272
2023-194654,2023-03-14,000001,Vente,580000,44,,AV DE LA PLAGE,1340,17630,17161,La Flotte,17,,,17161000AD0026,,,8,,,,,,,,,,1,4,Local industriel. commercial ou assimilé,78,0,,,,,,-1.316988,46.186272
2023-194654,2023-03-14,000001,Vente,580000,44,,AV DE LA PLAGE,1340,17630,17161,La Flotte,17,,,17161000AD0026,,,7,,,,,,,,,,1,4,Local industriel. commercial ou assimilé,60,0,,,,,,-1.316988,46.186272
2023-194769,2023-03-01,000001,Vente,1717632,29,,RUE ANDRE FAVREAU,0020,17630,17161,La Flotte,17,,,17161000AC0143,,,,,,,,,,,,,0,,,,,S,sols,,,62,-1.322605,46.185431
2023-194769,2023-03-01,000001,Vente,1717632,31,,RUE ANDRE FAVREAU,0020,17630,17161,La Flotte,17,,,17161000AC1174,,,,,,,,,,,,,0,1,Maison,180,7,S,sols,,,193,-1.32246,46.185432
2023-194934,2023-02-27,000001,Vente,450000,26,,RUE GUSTAVE DECHEZEAUX,0980,17630,17161,La Flotte,17,,,17161000AB0381,,,,,,,,,,,,,0,1,Maison,100,3,S,sols,,,72,-1.32696,46.18645
2023-194969,2023-03-16,000001,Vente,383000,29,,RUE GUSTAVE DECHEZEAUX,0980,17630,17161,La Flotte,17,,,17161000AC0323,,,,,,,,,,,,,0,1,Maison,120,2,S,sols,,,62,-1.327407,46.185865
2023-194993,2023-03-18,000001,Vente,200000,44,,AV DE LA PLAGE,1340,17630,17161,La Flotte,17,,,17161000AD0026,,,11,,,,,,,,,,1,4,Local industriel. commercial ou assimilé,74,0,,,,,,-1.316988,46.186272
2023-195005,2023-03-18,000001,Vente,200000,44,,AV DE LA PLAGE,1340,17630,17161,La Flotte,17,,,17161000AD0026,,,12,,,,,,,,,,1,4,Local industriel. commercial ou assimilé,74,0,,,,,,-1.316988,46.186272
2023-195128,2023-03-22,000001,Vente,653,,,LE PEUX NAUDIN,B162,17630,17161,La Flotte,17,,,17161000ZN0158,,,,,,,,,,,,,0,,,,,BR,futaies résineuses,,,610,-1.34113,46.172253
2023-195184,2023-03-28,000001,Vente,142000,6564,,LOT A.F.U.L. BEAUREGARD-EST,A001,17630,17161,La Flotte,17,,,17161000AE0150,,,,,,,,,,,,,0,4,Local industriel. commercial ou assimilé,,0,S,sols,,,11,-1.317032,46.182938
2023-195184,2023-03-28,000001,Vente,142000,14,,RUE DU PUITS LILOUX,1430,17630,17161,La Flotte,17,,,17161000AE0698,,,,,,,,,,,,,0,3,Dépendance,,0,S,sols,,,382,-1.317008,46.182893
2023-195184,2023-03-28,000001,Vente,142000,14,,RUE DU PUITS LILOUX,1430,17630,17161,La Flotte,17,,,17161000AE0698,,,,,,,,,,,,,0,1,Maison,99,4,S,sols,,,382,-1.317008,46.182893
2023-195184,2023-03-28,000001,Vente,142000,14,,RUE DU PUITS LILOUX,1430,17630,17161,La Flotte,17,,,17161000AE0698,,,,,,,,,,,,,0,3,Dépendance,,0,S,sols,,,382,-1.317008,46.182893
2023-195281,2023-03-13,000001,Vente,1250000,17,,VC RAIZE DES PELLETANTES,1279,17630,17161,La Flotte,17,,,17161000AL0460,,,,,,,,,,,,,0,1,Maison,139,4,S,sols,,,562,-1.336895,46.188563
2023-195281,2023-03-13,000001,Vente,1250000,17,,VC RAIZE DES PELLETANTES,1279,17630,17161,La Flotte,17,,,17161000AL0460,,,,,,,,,,,,,0,3,Dépendance,,0,S,sols,,,562,-1.336895,46.188563
2023-195490,2023-03-27,000001,Vente,950,,,LES FALIMORAUX,B065,17630,17161,La Flotte,17,,,171610000J1457,,,,,,,,,,,,,0,,,,,BR,futaies résineuses,,,888,-1.347822,46.173119
2023-195557,2023-03-30,000001,Vente,827000,3,,RUE DE L ARDILLIERS,0024,17630,17161,La Flotte,17,,,17161000AH0314,,,,,,,,,,,,,0,1,Maison,175,6,S,sols,,,519,-1.323122,46.182422
2023-195663,2023-03-31,000001,Vente,610000,21,,RUE DES OLIVIERS SAUVAGES,1215,17630,17161,La Flotte,17,,,17161000AB0777,,,,,,,,,,,,,0,1,Maison,59,3,S,sols,,,180,-1.331882,46.187206
2023-195725,2023-04-13,000001,Vente,950000,13,,RUE DE L ARDILLIERS,0024,17630,17161,La Flotte,17,,,17161000AH0494,,,,,,,,,,,,,0,1,Maison,180,7,S,sols,,,790,-1.322124,46.182391
2023-195879,2023-03-30,000001,Vente,651900,2,,RLE DE L AIRMORIN,0007,17630,17161,La Flotte,17,,,17161000AC0362,,,,,,,,,,,,,0,1,Maison,69,4,S,sols,,,121,-1.325994,46.185945
2023-195885,2023-04-05,000001,Vente,335000,7,,RUE DE LA TOUCHE,1760,17630,17161,La Flotte,17,,,17161000AL0853,,,,,,,,,,,,,0,1,Maison,64,3,S,sols,,,102,-1.3347,46.189725
2023-195923,2023-03-31,000001,Vente,2070,,,LE CLOS MARTIN,B042,17630,17161,La Flotte,17,,,17161000ZO0074,,,,,,,,,,,,,0,,,,,T,terres,,,2700,-1.339294,46.180214
2023-195949,2023-04-14,000001,Vente,600000,7,,CHE DE LA GARENNE,0700,17630,17161,La Flotte,17,,,17161000AL0236,,,,,,,,,,,,,0,1,Maison,100,4,S,sols,,,420,-1.336029,46.187948
2023-195949,2023-04-14,000001,Vente,600000,7,,CHE DE LA GARENNE,0700,17630,17161,La Flotte,17,,,17161000AL0236,,,,,,,,,,,,,0,3,Dépendance,,0,S,sols,,,420,-1.336029,46.187948
2023-196001,2023-04-21,000001,Vente,460.1,,,LES PEUX HAUTS,B130,17630,17161,La Flotte,17,,,171610000G0071,,,,,,,,,,,,,0,,,,,L,landes,FOUG,Fougeraie,430,-1.329011,46.169967
2023-196016,2023-04-20,000001,Vente,400000,,,RUE DU PUITS DE FER,1410,17630,17161,La Flotte,17,,,17161000AC0571,,,,,,,,,,,,,0,,,,,J,jardins,,,479,-1.322272,46.184313
2023-196039,2023-04-21,000001,Vente,383000,43,,RTE DE SAINT MARTIN,1521,17630,17161,La Flotte,17,,,17161000AL0021,,,24,32.86,,,,,,,,,1,1,Maison,37,1,,,,,,-1.336837,46.191326
2023-196274,2023-04-14,000001,Vente,300895,31,,RUE GASTON LEM,0780,17630,17161,La Flotte,17,,,17161000AC0448,,,,,,,,,,,,,0,1,Maison,40,1,S,sols,,,27,-1.324872,46.185728
2023-196316,2023-04-29,000001,Vente,450000,11,B,RUE DU CHIRON JAUNET,0446,17630,17161,La Flotte,17,,,17161000AL0084,,,,,,,,,,,,,0,1,Maison,58,3,S,sols,,,323,-1.338718,46.190709
2023-196418,2023-04-25,000001,Vente,1390,,,LE FOND DES PRES,B068,17630,17161,La Flotte,17,,,171610000H0708,,,,,,,,,,,,,0,,,,,T,terres,,,345,-1.33484,46.168318
2023-196418,2023-04-25,000001,Vente,1390,,,LE FOND DES PRES,B068,17630,17161,La Flotte,17,,,171610000H1029,,,,,,,,,,,,,0,,,,,BT,taillis simples,,,358,-1.335141,46.168416
2023-196418,2023-04-25,000001,Vente,1390,,,LE FOND DES PRES,B068,17630,17161,La Flotte,17,,,171610000H1030,,,,,,,,,,,,,0,,,,,BT,taillis simples,,,22,-1.335142,46.16829
2023-196418,2023-04-25,000001,Vente,1390,,,LE FOND DES PRES,B068,17630,17161,La Flotte,17,,,171610000H1031,,,,,,,,,,,,,0,,,,,BT,taillis simples,,,70,-1.335141,46.168252
2023-196418,2023-04-25,000001,Vente,1390,,,LE FOND DES PRES,B068,17630,17161,La Flotte,17,,,171610000H1032,,,,,,,,,,,,,0,,,,,BT,taillis simples,,,305,-1.335146,46.168131
2023-196418,2023-04-25,000001,Vente,1390,,,LE FOND DES PRES,B068,17630,17161,La Flotte,17,,,171610000H1033,,,,,,,,,,,,,0,,,,,T,terres,,,58,-1.335227,46.168237
2023-196418,2023-04-25,000001,Vente,1390,,,LE FOND DES PRES,B068,17630,17161,La Flotte,17,,,171610000H1034,,,,,,,,,,,,,0,,,,,T,terres,,,141,-1.335315,46.16833
2023-196534,2023-04-28,000001,Vente,1200000,58,,RUE GASTON LEM,0780,17630,17161,La Flotte,17,,,17161000AC1355,,,,,,,,,,,,,0,3,Dépendance,,0,,,,,,-1.323387,46.184571
2023-196534,2023-04-28,000001,Vente,1200000,58,,RUE GASTON LEM,0780,17630,17161,La Flotte,17,,,17161000AC1355,,,,,,,,,,,,,0,3,Dépendance,,0,,,,,,-1.323387,46.184571
2023-196869,2023-05-11,000001,Vente,253788.55,6,,RUE DES CHASSEURS,0441,17630,17161,La Flotte,17,,,17161000AC0411,,,,,,,,,,,,,0,1,Maison,268,6,J,jardins,,,722,-1.325387,46.184519
2023-196869,2023-05-11,000001,Vente,253788.55,6,,RUE DES CHASSEURS,0441,17630,17161,La Flotte,17,,,17161000AC0411,,,,,,,,,,,,,0,1,Maison,268,6,S,sols,,,582,-1.325387,46.184519
2023-196869,2023-05-11,000001,Vente,253788.55,6,,RUE DES CHASSEURS,0441,17630,17161,La Flotte,17,,,17161000AC0411,,,,,,,,,,,,,0,3,Dépendance,,0,S,sols,,,582,-1.325387,46.184519
2023-196869,2023-05-11,000001,Vente,253788.55,6,,RUE DES CHASSEURS,0441,17630,17161,La Flotte,17,,,17161000AC0411,,,,,,,,,,,,,0,3,Dépendance,,0,J,jardins,,,722,-1.325387,46.184519
2023-197053,2023-05-15,000001,Vente,637083,,,LE CARRE DE BEL EBAT,B031,17630,17161,La Flotte,17,,,17161000ZK0179,,,,,,,,,,,,,0,,,,,AB,terrains a bâtir,,,4,-1.340768,46.188967
2023-197053,2023-05-15,000001,Vente,637083,,,LE CARRE DE BEL EBAT,B031,17630,17161,La Flotte,17,,,17161000ZK0182,,,,,,,,,,,,,0,,,,,AB,terrains a bâtir,,,542,-1.340838,46.18889
2023-197190,2023-05-17,000001,Vente,680000,6577,,RLE DE LA MER,1091,17630,17161,La Flotte,17,,,17161000AD0301,,,,,,,,,,,,,0,1,Maison,70,3,S,sols,,,422,-1.314908,46.186997
2023-197322,2023-05-10,000001,Vente,628.09,,,LES PEUX HAUTS,B130,17630,17161,La Flotte,17,,,171610000F1986,,,,,,,,,,,,,0,,,,,L,landes,FOUG,Fougeraie,587,-1.325661,46.170282
2023-197357,2023-05-30,000001,Vente,560000,9,,QUAI DE SENAC,1640,17630,17161,La Flotte,17,,,17161000AC1082,,,3,64.22,,,,,,,,,1,1,Maison,64,3,,,,,,-1.324614,46.187249
2023-197357,2023-05-30,000001,Vente,560000,9,,QUAI DE SENAC,1640,17630,17161,La Flotte,17,,,17161000AC1082,,,2,232.48,,,,,,,,,1,1,Maison,232,1,,,,,,-1.324614,46.187249
2023-197479,2023-05-31,000001,Vente,1800000,8,,RUE ADRIEN PONSIN,0008,17630,17161,La Flotte,17,,,17161000AB0484,,,,,,,,,,,,,0,1,Maison,180,6,S,sols,,,795,-1.329616,46.188243
2023-197601,2023-05-16,000001,Vente,2150.7,,,LES ROBERDES,B147,17630,17161,La Flotte,17,,,17161000ZC0143,,,,,,,,,,,,,0,,,,,T,terres,,,2010,-1.309796,46.167437
2023-197602,2023-05-16,000001,Vente,1005.8,,,LES CAILLOTIERES OUEST,B030,17630,17161,La Flotte,17,,,17161000ZR0083,,,,,,,,,,,,,0,,,,,T,terres,,,940,-1.325308,46.179092
2023-197603,2023-05-25,000001,Vente,5863.6,,,LA MARE,B105,17630,17161,La Flotte,17,,,17161000ZW0145,,,,,,,,,,,,,0,,,,,T,terres,,,5480,-1.314042,46.177325
2023-197759,2023-06-01,000001,Vente,667000,16,,CHE DES BATAILLERES,0163,17630,17161,La Flotte,17,,,17161000AL0715,,,,,,,,,,,,,0,1,Maison,58,4,S,sols,,,498,-1.337739,46.187151
2023-197759,2023-06-01,000001,Vente,667000,16,,CHE DES BATAILLERES,0163,17630,17161,La Flotte,17,,,17161000AL0715,,,,,,,,,,,,,0,1,Maison,174,4,S,sols,,,498,-1.337739,46.187151
2023-197759,2023-06-01,000001,Vente,667000,16,,CHE DES BATAILLERES,0163,17630,17161,La Flotte,17,,,17161000ZK0195,,,,,,,,,,,,,0,,,,,S,sols,,,36,-1.337715,46.18706
2023-197896,2023-06-15,000001,Vente,300000,2,,CAR SAINT PIERRE,1560,17630,17161,La Flotte,17,,,17161000AC0297,,,,,,,,,,,,,0,,,,,AB,terrains a bâtir,,,110,-1.325939,46.186618
2023-198016,2023-06-22,000001,Vente,405000,5,,RUE DE LA GARDE,0680,17630,17161,La Flotte,17,,,17161000AC0220,,,,,,,,,,,,,0,4,Local industriel. commercial ou assimilé,86,0,S,sols,,,48,-1.324094,46.186736
2023-198116,2023-06-16,000001,Vente,544570,27,,RUE BAPTISTE BERNARD,0146,17630,17161,La Flotte,17,,,17161000AE0134,,,,,,,,,,,,,0,1,Maison,55,3,S,sols,,,308,-1.315785,46.182605
2023-198401,2023-06-30,000001,Vente,1793200,8,,RUE ARISTIDE GUIGNIER,0032,17630,17161,La Flotte,17,,,17161000AB0446,,,,,,,,,,,,,0,1,Maison,240,5,S,sols,,,381,-1.328547,46.187553
2023-198428,2023-06-20,000001,Vente,643700,18,,RUE DES OLIVIERS SAUVAGES,1215,17630,17161,La Flotte,17,,,17161000AB0758,,,,,,,,,,,,,0,1,Maison,82,5,S,sols,,,175,-1.332406,46.187737
2023-198476,2023-06-26,000001,Vente,835000,21,,RUE DU FOND DE COQUEREAU,0658,17630,17161,La Flotte,17,,,17161000AL0804,,,,,,,,,,,,,0,1,Maison,94,5,S,sols,,,309,-1.337648,46.190538
2023-198647,2023-06-30,000001,Vente,317757,23,,RUE DU MARCHE,1080,17630,17161,La Flotte,17,,,17161000AB0801,,,2,52.08,,,,,,,,,1,1,Maison,51,2,,,,,,-1.326781,46.187331
2023-198744,2023-07-05,000001,Vente,740000,4,,RUE GASTON LEM,0780,17630,17161,La Flotte,17,,,17161000AC0313,,,,,,,,,,,,,0,3,Dépendance,,0,S,sols,,,164,-1.326704,46.186263
2023-198744,2023-07-05,000001,Vente,740000,4,,RUE GASTON LEM,0780,17630,17161,La Flotte,17,,,17161000AC0313,,,,,,,,,,,,,0,1,Maison,160,5,S,sols,,,164,-1.326704,46.186263
2023-198806,2023-06-23,000001,Vente,498000,9,,RUE VOLCY FEVRE,1780,17630,17161,La Flotte,17,,,17161000AB0500,,,,,,,,,,,,,0,1,Maison,90,4,S,sols,,,57,-1.330018,46.188901
2023-198898,2023-07-07,000001,Vente,710000,15,,RUE DE L OCEAN,1211,17630,17161,La Flotte,17,,,17161000AD0272,,,,,,,,,,,,,0,1,Maison,50,3,S,sols,,,450,-1.316303,46.185716
2023-199214,2023-07-12,000001,Vente,1236000,5,B,RUE DE LA GARENNE,0720,17630,17161,La Flotte,17,,,17161000AB0595,,,,,,,,,,,,,0,1,Maison,132,4,S,sols,,,500,-1.332845,46.188362
2023-199214,2023-07-12,000001,Vente,1236000,5,B,RUE DE LA GARENNE,0720,17630,17161,La Flotte,17,,,17161000AB0595,,,,,,,,,,,,,0,3,Dépendance,,0,S,sols,,,500,-1.332845,46.188362
2023-199740,2023-07-11,000001,Vente,485000,11,,RUE DE LA MALADRERIE,1075,17630,17161,La Flotte,17,,,17161000AA0216,,,,,,,,,,,,,0,1,Maison,90,4,S,sols,,,277,-1.337172,46.193823
2023-199790,2023-07-21,000001,Vente,707000,2,,RUE DU PUITS CHARRAUD,1360,17630,17161,La Flotte,17,,,17161000AB0907,,,,,,,,,,,,,0,1,Maison,90,4,S,sols,,,175,-1.327845,46.185896
2023-199831,2023-08-08,000001,Vente,660000,13,,CHE DES POUZEREAUX,1355,17630,17161,La Flotte,17,,,17161000AE0341,,,,,,,,,,,,,0,3,Dépendance,,0,S,sols,,,413,-1.313878,46.184509
2023-199831,2023-08-08,000001,Vente,660000,13,,CHE DES POUZEREAUX,1355,17630,17161,La Flotte,17,,,17161000AE0341,,,,,,,,,,,,,0,1,Maison,58,2,S,sols,,,413,-1.313878,46.184509
2023-200035,2023-08-11,000001,Vente,1050000,14,,RUE DU FOND DE COQUEREAU,0658,17630,17161,La Flotte,17,,,17161000AL0317,,,,,,,,,,,,,0,1,Maison,127,4,S,sols,,,844,-1.335951,46.190633
2023-200035,2023-08-11,000001,Vente,1050000,14,,RUE DU FOND DE COQUEREAU,0658,17630,17161,La Flotte,17,,,17161000AL0317,,,,,,,,,,,,,0,3,Dépendance,,0,S,sols,,,844,-1.335951,46.190633
2023-200035,2023-08-11,000001,Vente,1050000,14,,RUE DU FOND DE COQUEREAU,0658,17630,17161,La Flotte,17,,,17161000AL0317,,,,,,,,,,,,,0,1,Maison,92,4,S,sols,,,844,-1.335951,46.190633
2023-200133,2023-08-03,000001,Vente,960000,55,,RUE DE LA TOUCHE,1760,17630,17161,La Flotte,17,,,17161000AM0763,,,,,,,,,,,,,0,1,Maison,121,4,S,sols,,,398,-1.340572,46.189477
2023-200144,2023-08-09,000001,Vente,620000,8,,RUE DES GEOFFRIELLES,0846,17630,17161,La Flotte,17,,,17161000AH0051,,,,,,,,,,,,,0,1,Maison,86,3,S,sols,,,330,-1.328784,46.183093
2023-200144,2023-08-09,000001,Vente,620000,10,,RUE DES GEOFFRIELLES,0846,17630,17161,La Flotte,17,,,17161000AH0404,,,,,,,,,,,,,0,,,,,S,sols,,,23,-1.328692,46.183011
2023-200362,2023-08-25,000001,Vente,434,,,LE FONT DE LIAUSE,B071,17630,17161,La Flotte,17,,,17161000AL0007,,,,,,,,,,,,,0,,,,,T,terres,,,405,-1.338771,46.192049
2023-200381,2023-08-30,000001,Vente,570000,3,,RUE GEORGES CLEMENCEAU,0850,17630,17161,La Flotte,17,,,17161000AB1093,,,,,,,,,,,,,0,1,Maison,67,2,S,sols,,,276,-1.332994,46.190652
2023-200456,2023-08-18,000001,Vente,5264.4,,,LES COURNAUX,B049,17630,17161,La Flotte,17,,,17161000ZC0072,,,,,,,,,,,,,0,,,,,L,landes,FRICH,Friche,4920,-1.31517,46.170211
2023-200551,2023-08-08,000001,Vente,570000,9,,RUE DE L EGLISE,0520,17630,17161,La Flotte,17,,,17161000AB0946,,,,,,,,,,,,,0,1,Maison,60,3,S,sols,,,88,-1.328466,46.187788
2023-200734,2023-08-28,000001,Vente,1260000,14,,RUE DE LA SERPENT,1690,17630,17161,La Flotte,17,,,17161000AA0059,,,,,,,,,,,,,0,1,Maison,336,8,S,sols,,,905,-1.335046,46.193705
2023-200734,2023-08-28,000001,Vente,1260000,14,,RUE DE LA SERPENT,1690,17630,17161,La Flotte,17,,,17161000AA0059,,,,,,,,,,,,,0,3,Dépendance,,0,S,sols,,,905,-1.335046,46.193705
2023-200798,2023-08-29,000001,Vente,535,,,LES CAILLOTIERES OUEST,B030,17630,17161,La Flotte,17,,,17161000ZR0085,,,,,,,,,,,,,0,,,,,AG,terrains d'agrément,,,500,-1.326025,46.179013
2023-200821,2023-08-30,000001,Vente,403500,13,,RTE DE SAINT MARTIN,1521,17630,17161,La Flotte,17,,,17161000AA0230,,,25,53.17,,,,,,,,,1,2,Appartement,53,3,,,,,,-1.333177,46.191603
2023-200821,2023-08-30,000001,Vente,403500,13,,RTE DE SAINT MARTIN,1521,17630,17161,La Flotte,17,,,17161000AA0230,,,138,,,,,,,,,,1,3,Dépendance,,0,,,,,,-1.333177,46.191603
2023-200840,2023-09-01,000001,Vente,245000,22,,RUE DU MARCHE,1080,17630,17161,La Flotte,17,,,17161000AB0225,,,2,,,,,,,,,,1,4,Local industriel. commercial ou assimilé,28,0,,,,,,-1.326495,46.187492
2023-200852,2023-08-30,000001,Vente,275000,18,,RUE ANDRE FAVREAU,0020,17630,17161,La Flotte,17,,,17161000AC0581,,,,,,,,,,,,,0,1,Maison,55,2,S,sols,,,56,-1.321956,46.184629
2023-200924,2023-09-11,000001,Vente,2046370,18,,RUE DE LA CLAVETTE,0480,17630,17161,La Flotte,17,,,17161000AB1068,,,,,,,,,,,,,0,1,Maison,205,6,S,sols,,,222,-1.329354,46.189027
2023-201060,2023-09-13,000001,Vente,701178.9,10,,RLE DE LA FANTAISIE,0632,17630,17161,La Flotte,17,,,17161000AC0116,,,,,,,,,,,,,0,1,Maison,79,3,S,sols,,,106,-1.321067,46.184902