id_mutation,date_mutation,numero_disposition,nature_mutation,valeur_fonciere,adresse_numero,adresse_suffixe,adresse_nom_voie,adresse_code_voie,code_postal,code_commune,nom_commune,code_departement,ancien_code_commune,ancien_nom_commune,id_parcelle,ancien_id_parcelle,numero_volume,lot1_numero,lot1_surface_carrez,lot2_numero,lot2_surface_carrez,lot3_numero,lot3_surface_carrez,lot4_numero,lot4_surface_carrez,lot5_numero,lot5_surface_carrez,nombre_lots,code_type_local,type_local,surface_reelle_bati,nombre_pieces_principales,code_nature_culture,nature_culture,code_nature_culture_speciale,nature_culture_speciale,surface_terrain,longitude,latitude
2023-192444,2023-01-12,000001,Vente,80000,14,,RUE DES OUCHETTES,0031,17290,17203,Landrais,17,,,172030000B1683,,,,,,,,,,,,,0,1,Maison,112,4,J,jardins,,,660,,
2023-192444,2023-01-12,000001,Vente,80000,14,,RUE DES OUCHETTES,0031,17290,17203,Landrais,17,,,172030000B1683,,,,,,,,,,,,,0,1,Maison,112,4,S,sols,,,500,,
2023-193939,2023-02-24,000001,Vente,1100,,,LE PRE MARECHAT,B043,17290,17203,Landrais,17,,,172030000D0287,,,,,,,,,,,,,0,,,,,T,terres,,,4350,-0.87192,46.073134
2023-194530,2023-02-23,000001,Vente,4500,,,LE FIEF CHOISI,B018,17290,17203,Landrais,17,,,172030000A0894,,,,,,,,,,,,,0,,,,,T,terres,,,11980,-0.893177,46.06829
2023-194546,2023-03-08,000001,Vente,100000,13,,RUE DU LOGIS,0022,17290,17203,Landrais,17,,,172030000B1846,,,,,,,,,,,,,0,1,Maison,100,2,S,sols,,,300,-0.861306,46.070753
2023-194546,2023-03-08,000001,Vente,100000,,,RUE DU LOGIS,0022,17290,17203,Landrais,17,,,172030000B1848,,,,,,,,,,,,,0,,,,,S,sols,,,230,-0.861121,46.07072
2023-194546,2023-03-08,000001,Vente,100000,,,RUE DU LOGIS,0022,17290,17203,Landrais,17,,,172030000B1850,,,,,,,,,,,,,0,,,,,S,sols,,,168,-0.860981,46.070671
2023-194596,2023-02-21,000002,Echange,14807.29,,,LE FIEF CHOISI,B018,17290,17203,Landrais,17,,,172030000A0884,,,,,,,,,,,,,0,,,,,T,terres,,,925,-0.891244,46.069976
2023-194596,2023-02-21,000002,Echange,14807.29,,,MONLIEU,B039,17290,17203,Landrais,17,,,17203000ZC0052,,,,,,,,,,,,,0,,,,,T,terres,,,27550,-0.879952,46.070439
2023-194605,2023-02-21,000002,Echange,2506.4,,,LE FIEF CHOISI,B018,17290,17203,Landrais,17,,,17203000ZC0011,,,,,,,,,,,,,0,,,,,T,terres,,,4820,-0.88785,46.069194
2023-194605,2023-02-21,000003,Echange,2506.4,,,MONLIEU,B039,17290,17203,Landrais,17,,,17203000ZC0043,,,,,,,,,,,,,0,,,,,T,terres,,,760,-0.883503,46.072003
2023-194605,2023-02-21,000003,Echange,2506.4,,,MONLIEU,B039,17290,17203,Landrais,17,,,17203000ZC0120,,,,,,,,,,,,,0,,,,,T,terres,,,4060,-0.883593,46.072002
2023-195071,2023-02-21,000002,Echange,840.32,,,LE FIEF CHOISI,B018,17290,17203,Landrais,17,,,172030000A0883,,,,,,,,,,,,,0,,,,,T,terres,,,1616,-0.891478,46.06937
2023-195138,2023-03-23,000001,Vente,57475,,,LES GRANGES,B033,17290,17203,Landrais,17,,,17203000ZE0109,,,,,,,,,,,,,0,,,,,AB,terrains a bâtir,,,605,-0.845771,46.073394
2023-195263,2023-03-01,000001,Vente,3005,,,LE PRE MARECHAT,B043,17290,17203,Landrais,17,,,172030000D0296,,,,,,,,,,,,,0,,,,,T,terres,,,1405,-0.868265,46.070497
2023-195984,2023-04-13,000001,Vente,290000,1,T,RUE DES OUCHETTES,0031,17290,17203,Landrais,17,,,172030000B1712,,,,,,,,,,,,,0,1,Maison,155,5,S,sols,,,1000,-0.862571,46.071118
2023-195984,2023-04-13,000001,Vente,290000,1,T,RUE DES OUCHETTES,0031,17290,17203,Landrais,17,,,172030000B1712,,,,,,,,,,,,,0,1,Maison,155,5,AG,terrains d'agrément,,,1218,-0.862571,46.071118
2023-197402,2023-05-10,000001,Vente,44400,,,RUE DES PUITS,0037,17290,17203,Landrais,17,,,172030000B0933,,,,,,,,,,,,,0,,,,,S,sols,,,120,-0.844269,46.072602
2023-199143,2023-07-19,000001,Vente,65000,17,B,RUE DU BREUIL ST JEAN,0005,17290,17203,Landrais,17,,,172030000B0624,,,,,,,,,,,,,0,3,Dépendance,,0,S,sols,,,55,-0.861953,46.068966
2023-199143,2023-07-19,000001,Vente,65000,17,B,RUE DU BREUIL ST JEAN,0005,17290,17203,Landrais,17,,,172030000B0624,,,,,,,,,,,,,0,1,Maison,74,2,S,sols,,,55,-0.861953,46.068966
2023-199143,2023-07-19,000001,Vente,65000,,,RUE DU BREUIL ST JEAN,0005,17290,17203,Landrais,17,,,172030000B1538,,,,,,,,,,,,,0,,,,,S,sols,,,254,-0.861848,46.068989
2023-199889,2023-08-08,000001,Vente,145000,3,,RUE DU LOGIS,0022,17290,17203,Landrais,17,,,172030000B0039,,,,,,,,,,,,,0,1,Maison,96,5,S,sols,,,490,-0.861955,46.069383
2023-199889,2023-08-08,000001,Vente,145000,3,,RUE DU LOGIS,0022,17290,17203,Landrais,17,,,172030000B0039,,,,,,,,,,,,,0,3,Dépendance,,0,S,sols,,,490,-0.861955,46.069383
2023-199889,2023-08-08,000001,Vente,145000,3,,RUE DU LOGIS,0022,17290,17203,Landrais,17,,,172030000B0039,,,,,,,,,,,,,0,3,Dépendance,,0,S,sols,,,490,-0.861955,46.069383
2023-200229,2023-08-23,000001,Vente,72550,,,LE LOGIS DE LANDRAIS,B036,17290,17203,Landrais,17,,,172030000B1488,,,,,,,,,,,,,0,,,,,T,terres,,,5682,-0.864845,46.070925
2023-201070,2023-09-05,000001,Vente,225000,9001,,LE FIEF DE LA POINTE,B022,17290,17203,Landrais,17,,,17203000ZC0091,,,,,,,,,,,,,0,4,Local industriel. commercial ou assimilé,403,0,S,sols,,,1700,-0.871908,46.073837
2023-201070,2023-09-05,000001,Vente,225000,,,LE FIEF DE LA POINTE,B022,17290,17203,Landrais,17,,,17203000ZC0093,,,,,,,,,,,,,0,,,,,S,sols,,,865,-0.871791,46.074073
2023-201796,2023-09-28,000001,Vente,100000,19,,RUE DU BREUIL ST JEAN,0005,17290,17203,Landrais,17,,,172030000B0625,,,,,,,,,,,,,0,1,Maison,134,5,S,sols,,,265,-0.861727,46.068922
2023-201796,2023-09-28,000001,Vente,100000,,,RUE DU BREUIL ST JEAN,0005,17290,17203,Landrais,17,,,172030000B0626,,,,,,,,,,,,,0,,,,,S,sols,,,60,-0.861593,46.06892
2023-202409,2023-10-12,000001,Vente,900,,,LE FIEF DE PERE,B023,17290,17203,Landrais,17,,,17203000ZK0110,,,,,,,,,,,,,0,,,,,T,terres,,,545,-0.854964,46.072469
2023-202409,2023-10-12,000001,Vente,900,,,LE FIEF DE PERE,B023,17290,17203,Landrais,17,,,17203000ZK0111,,,,,,,,,,,,,0,,,,,T,terres,,,555,-0.855036,46.072427
2023-202409,2023-10-12,000001,Vente,900,,,LE FIEF DE PERE,B023,17290,17203,Landrais,17,,,17203000ZK0112,,,,,,,,,,,,,0,,,,,T,terres,,,660,-0.855278,46.072513
2023-202483,2023-10-11,000001,Vente,41616.73,,,LES MINIMES,B038,17290,17203,Landrais,17,,,172030000A0267,,,,,,,,,,,,,0,,,,,BT,taillis simples,,,3090,-0.87297,46.086135
2023-202483,2023-10-11,000001,Vente,41616.73,,,LES MINIMES,B038,17290,17203,Landrais,17,,,172030000A0273,,,,,,,,,,,,,0,,,,,BT,taillis simples,,,2520,-0.876325,46.08721
2023-202483,2023-10-11,000001,Vente,41616.73,,,LES MINIMES,B038,17290,17203,Landrais,17,,,172030000A0275,,,,,,,,,,,,,0,,,,,T,terres,,,15410,-0.876234,46.087622
2023-202483,2023-10-11,000001,Vente,41616.73,,,LES MINIMES,B038,17290,17203,Landrais,17,,,172030000A0304,,,,,,,,,,,,,0,,,,,T,terres,,,1395,-0.870308,46.087083
2023-202483,2023-10-11,000001,Vente,41616.73,,,LES MINIMES,B038,17290,17203,Landrais,17,,,172030000A0305,,,,,,,,,,,,,0,,,,,T,terres,,,1679,-0.870199,46.087077
2023-202483,2023-10-11,000001,Vente,41616.73,,,LES MINIMES,B038,17290,17203,Landrais,17,,,172030000A0320,,,,,,,,,,,,,0,,,,,T,terres,,,1660,-0.868912,46.088301
2023-202483,2023-10-11,000001,Vente,41616.73,,,LES MINIMES,B038,17290,17203,Landrais,17,,,172030000A0321,,,,,,,,,,,,,0,,,,,T,terres,,,1430,-0.868762,46.088384
2023-202483,2023-10-11,000001,Vente,41616.73,,,SAINT GILLES,B045,17290,17203,Landrais,17,,,172030000A0326,,,,,,,,,,,,,0,,,,,T,terres,,,1170,-0.867548,46.089048
2023-202483,2023-10-11,000001,Vente,41616.73,,,SAINT GILLES,B045,17290,17203,Landrais,17,,,172030000A0331,,,,,,,,,,,,,0,,,,,T,terres,,,4260,-0.865921,46.088972
2023-202483,2023-10-11,000001,Vente,41616.73,,,LE BOIS DE MONLIEU NORD,B003,17290,17203,Landrais,17,,,172030000A0368,,,,,,,,,,,,,0,,,,,T,terres,,,8570,-0.884541,46.084997
2023-202866,2023-10-27,000001,Vente,165000,13,,RUE DES PEUPLIERS,0033,17290,17203,Landrais,17,,,172030000C0324,,,,,,,,,,,,,0,1,Maison,110,4,S,sols,,,65,-0.834744,46.060122
2023-202866,2023-10-27,000001,Vente,165000,,,CHABAN,B008,17290,17203,Landrais,17,,,172030000C0327,,,,,,,,,,,,,0,,,,,J,jardins,,,175,-0.834556,46.059857
2023-202866,2023-10-27,000001,Vente,165000,,,CHABAN,B008,17290,17203,Landrais,17,,,172030000C0379,,,,,,,,,,,,,0,,,,,J,jardins,,,905,-0.834664,46.059143
2023-202866,2023-10-27,000001,Vente,165000,,,CHABAN,B008,17290,17203,Landrais,17,,,172030000C0380,,,,,,,,,,,,,0,,,,,J,jardins,,,515,-0.834354,46.059147
2023-202866,2023-10-27,000001,Vente,165000,,,CHABAN,B008,17290,17203,Landrais,17,,,172030000C0381,,,,,,,,,,,,,0,,,,,J,jardins,,,950,-0.834412,46.059343
2023-202866,2023-10-27,000001,Vente,165000,,,LE MARAIS DE CHABAN,B037,17290,17203,Landrais,17,,,172030000C0438,,,,,,,,,,,,,0,,,,,BT,taillis simples,,,320,-0.834066,46.058091
2023-202866,2023-10-27,000001,Vente,165000,,,RUE DES PEUPLIERS,0033,17290,17203,Landrais,17,,,172030000C0608,,,,,,,,,,,,,0,,,,,S,sols,,,37,-0.834995,46.059736
2023-202866,2023-10-27,000001,Vente,165000,5309,,CHABAN,B008,17290,17203,Landrais,17,,,172030000C0629,,,,,,,,,,,,,0,3,Dépendance,,0,J,jardins,,,404,-0.834924,46.059499
2023-202866,2023-10-27,000001,Vente,165000,5309,,CHABAN,B008,17290,17203,Landrais,17,,,172030000C0629,,,,,,,,,,,,,0,3,Dépendance,,0,S,sols,,,583,-0.834924,46.059499
2023-202866,2023-10-27,000001,Vente,165000,5309,,CHABAN,B008,17290,17203,Landrais,17,,,172030000C0629,,,,,,,,,,,,,0,3,Dépendance,,0,J,jardins,,,404,-0.834924,46.059499
2023-202866,2023-10-27,000001,Vente,165000,5309,,CHABAN,B008,17290,17203,Landrais,17,,,172030000C0629,,,,,,,,,,,,,0,3,Dépendance,,0,S,sols,,,583,-0.834924,46.059499
2023-205316,2023-12-29,000001,Vente,134790,10,,RUE DES DEUX MOULINS,0010,17290,17203,Landrais,17,,,172030000B1493,,,,,,,,,,,,,0,1,Maison,62,4,S,sols,,,62,-0.86093,46.069522
2023-205316,2023-12-29,000001,Vente,134790,,,RUE DES DEUX MOULINS,0010,17290,17203,Landrais,17,,,172030000B1681,,,,,,,,,,,,,0,,,,,S,sols,,,6,-0.860916,46.069492
