id_mutation,date_mutation,numero_disposition,nature_mutation,valeur_fonciere,adresse_numero,adresse_suffixe,adresse_nom_voie,adresse_code_voie,code_postal,code_commune,nom_commune,code_departement,ancien_code_commune,ancien_nom_commune,id_parcelle,ancien_id_parcelle,numero_volume,lot1_numero,lot1_surface_carrez,lot2_numero,lot2_surface_carrez,lot3_numero,lot3_surface_carrez,lot4_numero,lot4_surface_carrez,lot5_numero,lot5_surface_carrez,nombre_lots,code_type_local,type_local,surface_reelle_bati,nombre_pieces_principales,code_nature_culture,nature_culture,code_nature_culture_speciale,nature_culture_speciale,surface_terrain,longitude,latitude
2023-213871,2023-01-09,000001,Vente,5900,7,,RTE DE BLET,0010,18130,18045,Chalivoy-Milon,18,,,18045000AA0028,,,,,,,,,,,,,0,1,Maison,103,6,S,sols,,,83,2.70455,46.860409
2023-214655,2023-02-07,000001,Vente,32500,117,,LE BOUDET,B019,18130,18045,Chalivoy-Milon,18,,,180450000B1078,,,,,,,,,,,,,0,1,Maison,100,2,S,sols,,,307,2.708042,46.854508
2023-214655,2023-02-07,000001,Vente,32500,,,LE BOUDET,B019,18130,18045,Chalivoy-Milon,18,,,180450000B1081,,,,,,,,,,,,,0,,,,,T,terres,,,1689,2.707289,46.85429
2023-214655,2023-02-07,000001,Vente,32500,,,LE BOUDET,B019,18130,18045,Chalivoy-Milon,18,,,180450000B1082,,,,,,,,,,,,,0,,,,,J,jardins,,,512,2.707668,46.854482
2023-215235,2023-03-17,000001,Vente,160000,,,LES GROS GUENINS,B121,18130,18045,Chalivoy-Milon,18,,,18045000AA0002,,,,,,,,,,,,,0,,,,,J,jardins,,,3688,2.701511,46.862364
2023-215235,2023-03-17,000001,Vente,160000,16,,RTE DE DUN,0020,18130,18045,Chalivoy-Milon,18,,,18045000AA0003,,,,,,,,,,,,,0,,,,,S,sols,,,68,2.701293,46.862096
2023-215235,2023-03-17,000001,Vente,160000,16,,RTE DE DUN,0020,18130,18045,Chalivoy-Milon,18,,,18045000AA0004,,,,,,,,,,,,,0,3,Dépendance,,0,S,sols,,,813,2.701333,46.862012
2023-215235,2023-03-17,000001,Vente,160000,16,,RTE DE DUN,0020,18130,18045,Chalivoy-Milon,18,,,18045000AA0004,,,,,,,,,,,,,0,3,Dépendance,,0,S,sols,,,813,2.701333,46.862012
2023-215235,2023-03-17,000001,Vente,160000,16,,RTE DE DUN,0020,18130,18045,Chalivoy-Milon,18,,,18045000AA0004,,,,,,,,,,,,,0,1,Maison,190,10,S,sols,,,813,2.701333,46.862012
2023-216510,2023-05-09,000001,Vente,20000,,,LE BOURG,B022,18130,18045,Chalivoy-Milon,18,,,18045000AA0099,,,,,,,,,,,,,0,,,,,S,sols,,,40,2.707167,46.859334
2023-216510,2023-05-09,000001,Vente,20000,41,,RUE GRANDE RUE,0024,18130,18045,Chalivoy-Milon,18,,,18045000AA0100,,,,,,,,,,,,,0,1,Maison,75,2,S,sols,,,190,2.707301,46.859267
2023-216510,2023-05-09,000001,Vente,20000,,,LE BOURG,B022,18130,18045,Chalivoy-Milon,18,,,18045000AA0101,,,,,,,,,,,,,0,,,,,J,jardins,,,627,2.707398,46.859434
2023-217256,2023-06-22,000001,Vente,7000,,,CHAMP DE LA RONCE,B047,18130,18045,Chalivoy-Milon,18,,,18045000AA0177,,,,,,,,,,,,,0,,,,,P,prés,,,14702,2.699683,46.85904
2023-217277,2023-06-30,000001,Vente,63274,,,LE BOURG,B022,18130,18045,Chalivoy-Milon,18,,,18045000AA0107,,,,,,,,,,,,,0,,,,,J,jardins,,,473,2.708532,46.859207
2023-217277,2023-06-30,000001,Vente,63274,47,,RUE GRANDE RUE,0024,18130,18045,Chalivoy-Milon,18,,,18045000AA0108,,,,,,,,,,,,,0,4,Local industriel. commercial ou assimilé,189,0,S,sols,,,947,2.708856,46.85914
2023-217277,2023-06-30,000001,Vente,63274,47,,RUE GRANDE RUE,0024,18130,18045,Chalivoy-Milon,18,,,18045000AA0108,,,,,,,,,,,,,0,4,Local industriel. commercial ou assimilé,189,0,J,jardins,,,204,2.708856,46.85914
2023-217277,2023-06-30,000001,Vente,63274,,,LE BOURG,B022,18130,18045,Chalivoy-Milon,18,,,18045000AA0109,,,,,,,,,,,,,0,,,,,S,sols,,,71,2.708845,46.85891
2023-217277,2023-06-30,000001,Vente,63274,,,LE BOURG,B022,18130,18045,Chalivoy-Milon,18,,,18045000AA0109,,,,,,,,,,,,,0,,,,,J,jardins,,,745,2.708845,46.85891
2023-217277,2023-06-30,000001,Vente,63274,,,LE BOURG,B022,18130,18045,Chalivoy-Milon,18,,,18045000AA0109,,,,,,,,,,,,,0,,,,,P,prés,,,1325,2.708845,46.85891
2023-217277,2023-06-30,000001,Vente,63274,,,LES CRES BOUCHES,B084,18130,18045,Chalivoy-Milon,18,,,180450000B0027,,,,,,,,,,,,,0,,,,,T,terres,,,9455,2.696766,46.862062
2023-217277,2023-06-30,000001,Vente,63274,,,LA DESERTINE,B089,18130,18045,Chalivoy-Milon,18,,,180450000B0229,,,,,,,,,,,,,0,,,,,T,terres,,,5670,2.702433,46.857835
2023-217277,2023-06-30,000001,Vente,63274,,,LA DESERTINE,B089,18130,18045,Chalivoy-Milon,18,,,180450000B0230,,,,,,,,,,,,,0,,,,,P,prés,,,5225,2.702769,46.858409
2023-217277,2023-06-30,000001,Vente,63274,,,LES RUESSES POLARDS,B197,18130,18045,Chalivoy-Milon,18,,,180450000B0283,,,,,,,,,,,,,0,,,,,T,terres,,,9780,2.705618,46.851469
2023-217277,2023-06-30,000001,Vente,63274,,,LES RUESSES POLARDS,B197,18130,18045,Chalivoy-Milon,18,,,180450000B0286,,,,,,,,,,,,,0,,,,,T,terres,,,8135,2.70387,46.853965
2023-217277,2023-06-30,000001,Vente,63274,,,LE CHAMP JACQUES,B057,18130,18045,Chalivoy-Milon,18,,,180450000B0291,,,,,,,,,,,,,0,,,,,T,terres,,,13010,2.705281,46.854594
2023-217277,2023-06-30,000001,Vente,63274,,,LES CHARMES,B071,18130,18045,Chalivoy-Milon,18,,,180450000B0455,,,,,,,,,,,,,0,,,,,T,terres,,,7300,2.713588,46.863201
2023-217277,2023-06-30,000001,Vente,63274,,,LES CHARMES,B071,18130,18045,Chalivoy-Milon,18,,,180450000B0456,,,,,,,,,,,,,0,,,,,T,terres,,,5655,2.714679,46.863367
2023-217277,2023-06-30,000001,Vente,63274,,,RUESSES DES CIERGES,B196,18130,18045,Chalivoy-Milon,18,,,180450000B0639,,,,,,,,,,,,,0,,,,,T,terres,,,5510,2.709392,46.867416
2023-217277,2023-06-30,000001,Vente,63274,,,RUESSES DES CIERGES,B196,18130,18045,Chalivoy-Milon,18,,,180450000B0639,,,,,,,,,,,,,0,,,,,T,terres,,,11020,2.709392,46.867416
2023-217277,2023-06-30,000001,Vente,63274,,,LE CHAILLOUX,B031,18130,18045,Chalivoy-Milon,18,,,180450000B0873,,,,,,,,,,,,,0,,,,,P,prés,,,56360,2.709336,46.859966
2023-217277,2023-06-30,000001,Vente,63274,,,LE CHAILLOUX,B031,18130,18045,Chalivoy-Milon,18,,,180450000B0898,,,,,,,,,,,,,0,,,,,P,prés,,,72,2.708268,46.860415
2023-217277,2023-06-30,000001,Vente,63274,,,LES PETITS CHAMPS,B147,18130,18045,Chalivoy-Milon,18,,,180450000B0930,,,,,,,,,,,,,0,,,,,T,terres,,,20615,2.725064,46.866864
2023-217277,2023-06-30,000001,Vente,63274,,,LES PETITS CHAMPS,B147,18130,18045,Chalivoy-Milon,18,,,180450000B0930,,,,,,,,,,,,,0,,,,,T,terres,,,41230,2.725064,46.866864
2023-217277,2023-06-30,000001,Vente,63274,,,LE BOIS RENAULT,B018,18130,18045,Chalivoy-Milon,18,,,180450000C0128,,,,,,,,,,,,,0,,,,,T,terres,,,2620,2.723087,46.861631
2023-217277,2023-06-30,000001,Vente,63274,,,LA BRUYERE DU BOUDET,B025,18130,18045,Chalivoy-Milon,18,,,180450000C0311,,,,,,,,,,,,,0,,,,,T,terres,,,5490,2.716172,46.854794
2023-217810,2023-07-25,000001,Vente,100000,14,,VAILLY,B207,18130,18045,Chalivoy-Milon,18,,,18045000ZA0007,,,,,,,,,,,,,0,1,Maison,64,2,P,prés,,,9235,2.729759,46.860895
2023-217810,2023-07-25,000001,Vente,100000,14,,VAILLY,B207,18130,18045,Chalivoy-Milon,18,,,18045000ZA0007,,,,,,,,,,,,,0,1,Maison,64,2,S,sols,,,500,2.729759,46.860895
2023-220837,2023-12-11,000001,Vente,86500,8,,RUE DES FONTAINES,0022,18130,18045,Chalivoy-Milon,18,,,180450000B0956,,,,,,,,,,,,,0,3,Dépendance,,0,J,jardins,,,680,2.712558,46.856641
2023-220837,2023-12-11,000001,Vente,86500,8,,RUE DES FONTAINES,0022,18130,18045,Chalivoy-Milon,18,,,180450000B0956,,,,,,,,,,,,,0,1,Maison,134,5,S,sols,,,401,2.712558,46.856641
2023-220837,2023-12-11,000001,Vente,86500,8,,RUE DES FONTAINES,0022,18130,18045,Chalivoy-Milon,18,,,180450000B0956,,,,,,,,,,,,,0,3,Dépendance,,0,S,sols,,,401,2.712558,46.856641
2023-220837,2023-12-11,000001,Vente,86500,8,,RUE DES FONTAINES,0022,18130,18045,Chalivoy-Milon,18,,,180450000B0956,,,,,,,,,,,,,0,1,Maison,134,5,J,jardins,,,680,2.712558,46.856641
2023-220837,2023-12-11,000001,Vente,86500,,,LE BOUDET,B019,18130,18045,Chalivoy-Milon,18,,,180450000B0970,,,,,,,,,,,,,0,,,,,T,terres,,,86,2.712718,46.856655
