id_mutation,date_mutation,numero_disposition,nature_mutation,valeur_fonciere,adresse_numero,adresse_suffixe,adresse_nom_voie,adresse_code_voie,code_postal,code_commune,nom_commune,code_departement,ancien_code_commune,ancien_nom_commune,id_parcelle,ancien_id_parcelle,numero_volume,lot1_numero,lot1_surface_carrez,lot2_numero,lot2_surface_carrez,lot3_numero,lot3_surface_carrez,lot4_numero,lot4_surface_carrez,lot5_numero,lot5_surface_carrez,nombre_lots,code_type_local,type_local,surface_reelle_bati,nombre_pieces_principales,code_nature_culture,nature_culture,code_nature_culture_speciale,nature_culture_speciale,surface_terrain,longitude,latitude
2023-510452,2023-01-06,000002,Vente,1,,,LE MITOLET,B027,38330,38431,Saint-Nazaire-les-Eymes,38,,,38431000AE0338,,,,,,,,,,,,,0,,,,,S,sols,,,2060,5.850363,45.253989
2023-510518,2023-01-13,000001,Vente,534750,155,,CHE DU CLOS,0100,38330,38431,Saint-Nazaire-les-Eymes,38,,,38431000AK0307,,,,,,,,,,,,,0,1,Maison,124,4,S,sols,,,1078,5.853427,45.249429
2023-510518,2023-01-13,000001,Vente,534750,,,CLOS,B013,38330,38431,Saint-Nazaire-les-Eymes,38,,,38431000AK0308,,,,,,,,,,,,,0,,,,,L,landes,MARAI,Pré marais,56,5.853787,45.24903
2023-510676,2023-01-05,000001,Vente,708600,204,,CHE DU PIAT,0230,38330,38431,Saint-Nazaire-les-Eymes,38,,,38431000AI0181,,,,,,,,,,,,,0,1,Maison,129,4,S,sols,,,990,5.848882,45.252214
2023-510776,2023-01-20,000001,Vente,223000,146,,IMP DU PETIT PONT,0224,38330,38431,Saint-Nazaire-les-Eymes,38,,,38431000AM0148,,,106,,141,,,,,,,,2,3,Dépendance,,0,,,,,,5.849618,45.241981
2023-510776,2023-01-20,000001,Vente,223000,146,,IMP DU PETIT PONT,0224,38330,38431,Saint-Nazaire-les-Eymes,38,,,38431000AM0148,,,106,,141,,,,,,,,2,2,Appartement,49,2,,,,,,5.849618,45.241981
2023-510783,2023-01-26,000001,Vente,315500,204,,CHE DU PIAT,0230,38330,38431,Saint-Nazaire-les-Eymes,38,,,38431000AI0191,,,4,69.63,,,,,,,,,1,2,Appartement,69,3,,,,,,5.848789,45.252494
2023-510783,2023-01-26,000001,Vente,315500,204,,CHE DU PIAT,0230,38330,38431,Saint-Nazaire-les-Eymes,38,,,38431000AI0193,,,1,10,,,,,,,,,1,3,Dépendance,,0,,,,,,5.84895,45.252852
2023-511145,2023-02-06,000001,Vente,362500,27,,IMP DU PETIT PONT,0224,38330,38431,Saint-Nazaire-les-Eymes,38,,,38431000AM0072,,,28,,,,,,,,,,1,3,Dépendance,,0,,,,,,5.850659,45.243074
2023-511145,2023-02-06,000001,Vente,362500,27,,IMP DU PETIT PONT,0224,38330,38431,Saint-Nazaire-les-Eymes,38,,,38431000AM0072,,,45,,,,,,,,,,1,3,Dépendance,,0,,,,,,5.850659,45.243074
2023-511145,2023-02-06,000001,Vente,362500,27,,IMP DU PETIT PONT,0224,38330,38431,Saint-Nazaire-les-Eymes,38,,,38431000AM0072,,,96,,,,,,,,,,1,2,Appartement,90,4,,,,,,5.850659,45.243074
2023-511184,2023-01-24,000001,Vente,388500,27,,IMP DU PETIT PONT,0224,38330,38431,Saint-Nazaire-les-Eymes,38,,,38431000AM0072,,,140,109.03,147,,,,,,,,2,1,Maison,110,5,,,,,,5.850659,45.243074
2023-511207,2023-01-13,000001,Vente,540000,,,LES EYMES,B017,38330,38431,Saint-Nazaire-les-Eymes,38,,,38431000AH0120,,,,,,,,,,,,,0,,,,,L,landes,MARAI,Pré marais,181,5.845339,45.255184
2023-511207,2023-01-13,000001,Vente,540000,,,LES EYMES,B017,38330,38431,Saint-Nazaire-les-Eymes,38,,,38431000AH0121,,,,,,,,,,,,,0,,,,,S,sols,,,48,5.845093,45.255097
2023-511207,2023-01-13,000001,Vente,540000,508,,CHE DU CERF,0080,38330,38431,Saint-Nazaire-les-Eymes,38,,,38431000AH0431,,,,,,,,,,,,,0,3,Dépendance,,0,S,sols,,,1011,5.845503,45.255128
2023-511207,2023-01-13,000001,Vente,540000,508,,CHE DU CERF,0080,38330,38431,Saint-Nazaire-les-Eymes,38,,,38431000AH0431,,,,,,,,,,,,,0,1,Maison,105,6,S,sols,,,1011,5.845503,45.255128
2023-511519,2023-01-30,000001,Vente,1000,,,LES MIRIBELLES,B026,38330,38431,Saint-Nazaire-les-Eymes,38,,,38431000AK0139,,,,,,,,,,,,,0,,,,,P,prés,,,1047,5.855657,45.248721
2023-511947,2023-02-15,000001,Vente,546500,232,,CHE DES PINARDES,0250,38330,38431,Saint-Nazaire-les-Eymes,38,,,38431000AC0099,,,,,,,,,,,,,0,3,Dépendance,,0,S,sols,,,746,5.848376,45.261861
2023-511947,2023-02-15,000001,Vente,546500,232,,CHE DES PINARDES,0250,38330,38431,Saint-Nazaire-les-Eymes,38,,,38431000AC0099,,,,,,,,,,,,,0,1,Maison,111,4,AG,terrains d'agrément,PARC,Parc,1176,5.848376,45.261861
2023-511947,2023-02-15,000001,Vente,546500,232,,CHE DES PINARDES,0250,38330,38431,Saint-Nazaire-les-Eymes,38,,,38431000AC0099,,,,,,,,,,,,,0,1,Maison,111,4,S,sols,,,746,5.848376,45.261861
2023-511947,2023-02-15,000001,Vente,546500,232,,CHE DES PINARDES,0250,38330,38431,Saint-Nazaire-les-Eymes,38,,,38431000AC0099,,,,,,,,,,,,,0,3,Dépendance,,0,AG,terrains d'agrément,PARC,Parc,1176,5.848376,45.261861
2023-514075,2023-03-23,000001,Vente,685000,53,,CHE DES VIGNES,0381,38330,38431,Saint-Nazaire-les-Eymes,38,,,38431000AB0286,,,,,,,,,,,,,0,3,Dépendance,,0,S,sols,,,963,5.843464,45.260747
2023-514075,2023-03-23,000001,Vente,685000,53,,CHE DES VIGNES,0381,38330,38431,Saint-Nazaire-les-Eymes,38,,,38431000AB0286,,,,,,,,,,,,,0,1,Maison,149,7,S,sols,,,963,5.843464,45.260747
2023-514075,2023-03-23,000001,Vente,685000,,,BARATIERE,B002,38330,38431,Saint-Nazaire-les-Eymes,38,,,38431000AB0393,,,,,,,,,,,,,0,,,,,P,prés,,,219,5.843258,45.260775
2023-515523,2023-04-28,000001,Vente,285300,92,,CHE DU CHEMINET,0095,38330,38431,Saint-Nazaire-les-Eymes,38,,,38431000AE0094,,,,,,,,,,,,,0,1,Maison,35,1,S,sols,,,541,5.852225,45.25468
2023-515568,2023-05-05,000001,Vente,540000,,,BRINCHET,B007,38330,38431,Saint-Nazaire-les-Eymes,38,,,38431000AE0169,,,,,,,,,,,,,0,,,,,J,jardins,POTAG,Jardin potager,619,5.851979,45.253444
2023-515568,2023-05-05,000001,Vente,540000,114,,CHE DU BRINCHET,0060,38330,38431,Saint-Nazaire-les-Eymes,38,,,38431000AE0191,,,,,,,,,,,,,0,1,Maison,120,5,S,sols,,,270,5.852119,45.253584
2023-515568,2023-05-05,000001,Vente,540000,114,,CHE DU BRINCHET,0060,38330,38431,Saint-Nazaire-les-Eymes,38,,,38431000AE0236,,,,,,,,,,,,,0,,,,,S,sols,,,111,5.852041,45.253727
2023-515755,2023-04-27,000001,Vente,610250,880,,CHE DE LA TOUVIERE,0360,38330,38431,Saint-Nazaire-les-Eymes,38,,,38431000AH0026,,,,,,,,,,,,,0,1,Maison,150,4,S,sols,,,1032,5.844382,45.250882
2023-515992,2023-05-09,000001,Vente,355000,,,LES EYMES,B017,38330,38431,Saint-Nazaire-les-Eymes,38,,,38431000AH0120,,,,,,,,,,,,,0,,,,,L,landes,MARAI,Pré marais,181,5.845339,45.255184
2023-515992,2023-05-09,000001,Vente,355000,,,LES EYMES,B017,38330,38431,Saint-Nazaire-les-Eymes,38,,,38431000AH0121,,,,,,,,,,,,,0,,,,,S,sols,,,48,5.845093,45.255097
2023-515992,2023-05-09,000001,Vente,355000,,,LES EYMES,B017,38330,38431,Saint-Nazaire-les-Eymes,38,,,38431000AH0430,,,,,,,,,,,,,0,,,,,AB,terrains a bâtir,,,415,5.845167,45.254918
2023-515992,2023-05-09,000001,Vente,355000,508,,CHE DU CERF,0080,38330,38431,Saint-Nazaire-les-Eymes,38,,,38431000AH0432,,,,,,,,,,,,,0,,,,,AB,terrains a bâtir,,,582,5.845253,45.254982
2023-516232,2023-05-15,000001,Vente,675000,62,,CHE DES DROGEAUX,0140,38330,38431,Saint-Nazaire-les-Eymes,38,,,38431000AL0156,,,,,,,,,,,,,0,1,Maison,75,4,S,sols,,,2242,5.855655,45.250664
2023-516232,2023-05-15,000001,Vente,675000,62,,CHE DES DROGEAUX,0140,38330,38431,Saint-Nazaire-les-Eymes,38,,,38431000AL0156,,,,,,,,,,,,,0,3,Dépendance,,0,S,sols,,,2242,5.855655,45.250664
2023-516232,2023-05-15,000001,Vente,675000,62,,CHE DES DROGEAUX,0140,38330,38431,Saint-Nazaire-les-Eymes,38,,,38431000AL0156,,,,,,,,,,,,,0,1,Maison,96,6,S,sols,,,2242,5.855655,45.250664
2023-516827,2023-05-15,000002,Vente,389800,62,,CHE DES DROGEAUX,0140,38330,38431,Saint-Nazaire-les-Eymes,38,,,38431000AL0214,,,,,,,,,,,,,0,1,Maison,96,6,S,sols,,,606,,
2023-516827,2023-05-15,000002,Vente,389800,62,,CHE DES DROGEAUX,0140,38330,38431,Saint-Nazaire-les-Eymes,38,,,38431000AL0214,,,,,,,,,,,,,0,1,Maison,75,4,S,sols,,,606,,
2023-516827,2023-05-15,000002,Vente,389800,62,,CHE DES DROGEAUX,0140,38330,38431,Saint-Nazaire-les-Eymes,38,,,38431000AL0214,,,,,,,,,,,,,0,3,Dépendance,,0,S,sols,,,606,,
2023-516827,2023-05-15,000002,Vente,389800,113,,CHE DES ECOUTOUX,0150,38330,38431,Saint-Nazaire-les-Eymes,38,,,38431000AL0217,,,,,,,,,,,,,0,,,,,S,sols,,,389,,
2023-516964,2023-06-13,000001,Vente,1555,,,LE VILLAGE,B043,38330,38431,Saint-Nazaire-les-Eymes,38,,,38431000AK0281,,,,,,,,,,,,,0,,,,,L,landes,MARAI,Pré marais,311,5.847963,45.245003
2023-517330,2023-06-01,000001,Vente,295000,113,,CHE DES ECOUTOUX,0150,38330,38431,Saint-Nazaire-les-Eymes,38,,,38431000AL0216,,,,,,,,,,,,,0,,,,,S,sols,,,541,,
2023-517520,2023-06-19,000001,Vente,397040,661,,RTE DE CHAMBERY,0275,38330,38431,Saint-Nazaire-les-Eymes,38,,,38431000AE0294,,,7,93.41,,,,,,,,,1,2,Appartement,93,4,,,,,,5.848502,45.256608
2023-517520,2023-06-19,000001,Vente,397040,661,,RTE DE CHAMBERY,0275,38330,38431,Saint-Nazaire-les-Eymes,38,,,38431000AE0294,,,5,,,,,,,,,,1,3,Dépendance,,0,,,,,,5.848502,45.256608
2023-517520,2023-06-19,000001,Vente,397040,661,,RTE DE CHAMBERY,0275,38330,38431,Saint-Nazaire-les-Eymes,38,,,38431000AE0294,,,3,,,,,,,,,,1,3,Dépendance,,0,,,,,,5.848502,45.256608
2023-517520,2023-06-19,000001,Vente,397040,661,,RTE DE CHAMBERY,0275,38330,38431,Saint-Nazaire-les-Eymes,38,,,38431000AE0294,,,5,,,,,,,,,,1,3,Dépendance,,0,,,,,,5.848502,45.256608
2023-517627,2023-06-20,000001,Echange,480000,279,,CHE DES DROGEAUX,0140,38330,38431,Saint-Nazaire-les-Eymes,38,,,38431000AL0167,,,,,,,,,,,,,0,1,Maison,103,4,S,sols,,,1022,5.857751,45.252117
2023-517628,2023-06-20,000002,Echange,275000,180,,IMP DU PETIT PONT,0224,38330,38431,Saint-Nazaire-les-Eymes,38,,,38431000AM0148,,,125,,,,,,,,,,1,3,Dépendance,,0,,,,,,5.849618,45.241981
2023-517628,2023-06-20,000002,Echange,275000,180,,IMP DU PETIT PONT,0224,38330,38431,Saint-Nazaire-les-Eymes,38,,,38431000AM0148,,,113,,,,,,,,,,1,2,Appartement,67,3,,,,,,5.849618,45.241981
2023-517630,2023-06-01,000001,Vente,4859.4,,,BIGILLON,B005,38330,38431,Saint-Nazaire-les-Eymes,38,,,38431000ZC0148,,,,,,,,,,,,,0,,,,,T,terres,,,8099,5.859134,45.24136
2023-517724,2023-06-20,000001,Vente,17000,180,,IMP DU PETIT PONT,0224,38330,38431,Saint-Nazaire-les-Eymes,38,,,38431000AM0148,,,133,,,,,,,,,,1,3,Dépendance,,0,,,,,,5.849618,45.241981
2023-518259,2023-06-30,000001,Vente,595850,61,,CHE DU BRINCHET,0060,38330,38431,Saint-Nazaire-les-Eymes,38,,,38431000AE0047,,,,,,,,,,,,,0,1,Maison,159,7,S,sols,,,768,5.850521,45.253432
2023-518785,2023-07-03,000001,Vente,2350000,,,LES EYMES,B017,38330,38431,Saint-Nazaire-les-Eymes,38,,,38431000AE0339,,,,,,,,,,,,,0,,,,,AB,terrains a bâtir,,,123,5.848979,45.256078
2023-518785,2023-07-03,000001,Vente,2350000,,,LES EYMES,B017,38330,38431,Saint-Nazaire-les-Eymes,38,,,38431000AE0343,,,,,,,,,,,,,0,,,,,AB,terrains a bâtir,,,5019,5.84862,45.255736
2023-518785,2023-07-03,000001,Vente,2350000,,,LES EYMES,B017,38330,38431,Saint-Nazaire-les-Eymes,38,,,38431000AE0344,,,,,,,,,,,,,0,,,,,S,sols,,,71,5.848179,45.25546
2023-518785,2023-07-03,000001,Vente,2350000,,,LES EYMES,B017,38330,38431,Saint-Nazaire-les-Eymes,38,,,38431000AE0345,,,,,,,,,,,,,0,,,,,AB,terrains a bâtir,,,2967,5.848815,45.255526
2023-518785,2023-07-03,000001,Vente,2350000,,,LES EYMES,B017,38330,38431,Saint-Nazaire-les-Eymes,38,,,38431000AE0346,,,,,,,,,,,,,0,,,,,S,sols,,,241,5.848778,45.255334
2023-518785,2023-07-03,000001,Vente,2350000,,,LES EYMES,B017,38330,38431,Saint-Nazaire-les-Eymes,38,,,38431000AE0350,,,,,,,,,,,,,0,,,,,AB,terrains a bâtir,,,199,5.848073,45.255711
2023-518785,2023-07-03,000001,Vente,2350000,,,LES EYMES,B017,38330,38431,Saint-Nazaire-les-Eymes,38,,,38431000AE0351,,,,,,,,,,,,,0,,,,,S,sols,,,42,5.848011,45.255684
2023-518794,2023-07-06,000001,Vente,250000,27,,IMP DU PETIT PONT,0224,38330,38431,Saint-Nazaire-les-Eymes,38,,,38431000AM0072,,,82,65.98,,,,,,,,,1,2,Appartement,67,2,,,,,,5.850659,45.243074
2023-518794,2023-07-06,000001,Vente,250000,27,,IMP DU PETIT PONT,0224,38330,38431,Saint-Nazaire-les-Eymes,38,,,38431000AM0072,,,17,,,,,,,,,,1,3,Dépendance,,0,,,,,,5.850659,45.243074
2023-519035,2023-07-11,000001,Vente,323000,27,,IMP DU PETIT PONT,0224,38330,38431,Saint-Nazaire-les-Eymes,38,,,38431000AM0072,,,40,,,,,,,,,,1,3,Dépendance,,0,,,,,,5.850659,45.243074
2023-519035,2023-07-11,000001,Vente,323000,27,,IMP DU PETIT PONT,0224,38330,38431,Saint-Nazaire-les-Eymes,38,,,38431000AM0072,,,92,,,,,,,,,,1,2,Appartement,80,3,,,,,,5.850659,45.243074
2023-519035,2023-07-11,000001,Vente,323000,27,,IMP DU PETIT PONT,0224,38330,38431,Saint-Nazaire-les-Eymes,38,,,38431000AM0072,,,27,,,,,,,,,,1,3,Dépendance,,0,,,,,,5.850659,45.243074
2023-519170,2023-07-06,000001,Vente,530000,149,,CHE DU PICAPOUR,0235,38330,38431,Saint-Nazaire-les-Eymes,38,,,38431000AE0139,,,,,,,,,,,,,0,1,Maison,192,8,P,prés,,,1580,5.852925,45.252237
2023-519170,2023-07-06,000001,Vente,530000,149,,CHE DU PICAPOUR,0235,38330,38431,Saint-Nazaire-les-Eymes,38,,,38431000AE0139,,,,,,,,,,,,,0,1,Maison,192,8,S,sols,,,900,5.852925,45.252237
2023-519882,2023-07-11,000001,Vente,390000,106,,CHE DU CLOS,0100,38330,38431,Saint-Nazaire-les-Eymes,38,,,38431000AK0490,,,,,,,,,,,,,0,,,,,AB,terrains a bâtir,,,845,5.852708,45.247593
2023-520060,2023-07-25,000001,Vente,576350,,,BRINCHET,B007,38330,38431,Saint-Nazaire-les-Eymes,38,,,38431000AK0104,,,,,,,,,,,,,0,,,,,T,terres,,,126,5.854061,45.252085
2023-520060,2023-07-25,000001,Vente,576350,210,,CHE DU PICAPOUR,0235,38330,38431,Saint-Nazaire-les-Eymes,38,,,38431000AK0105,,,,,,,,,,,,,0,1,Maison,220,6,S,sols,,,1272,5.85406,45.252024
2023-520060,2023-07-25,000001,Vente,576350,210,,CHE DU PICAPOUR,0235,38330,38431,Saint-Nazaire-les-Eymes,38,,,38431000AK0105,,,,,,,,,,,,,0,3,Dépendance,,0,S,sols,,,1272,5.85406,45.252024
2023-520891,2023-08-18,000001,Vente,194350,720,,CHE DE LA MAIRIE,0215,38330,38431,Saint-Nazaire-les-Eymes,38,,,38431000AI0190,,,29,,,,,,,,,,1,3,Dépendance,,0,,,,,,5.850732,45.251647
2023-520891,2023-08-18,000001,Vente,194350,720,,CHE DE LA MAIRIE,0215,38330,38431,Saint-Nazaire-les-Eymes,38,,,38431000AI0190,,,6,,,,,,,,,,1,2,Appartement,49,2,,,,,,5.850732,45.251647
2023-521447,2023-09-05,000002,Vente,190000,484,,CHE DU PRE DE L ACHARD,0260,38330,38431,Saint-Nazaire-les-Eymes,38,,,38431000AC0503,,,,,,,,,,,,,0,,,,,S,sols,,,341,,
2023-522435,2023-09-26,000001,Vente,645000,107,,CHE DE BEAUREGARD,0040,38330,38431,Saint-Nazaire-les-Eymes,38,,,38431000AB0503,,,,,,,,,,,,,0,1,Maison,120,5,S,sols,,,600,5.84823,45.258605
2023-522530,2023-10-02,000001,Vente,674000,131,,IMP DU VAL CLAIR,0365,38330,38431,Saint-Nazaire-les-Eymes,38,,,38431000AH0150,,,,,,,,,,,,,0,1,Maison,151,9,S,sols,,,1103,5.846726,45.254407
2023-522530,2023-10-02,000001,Vente,674000,131,,IMP DU VAL CLAIR,0365,38330,38431,Saint-Nazaire-les-Eymes,38,,,38431000AH0150,,,,,,,,,,,,,0,3,Dépendance,,0,S,sols,,,1103,5.846726,45.254407
2023-523033,2023-10-20,000001,Vente en l'état futur d'achèvement,449000,,,,,,38431,Saint-Nazaire-les-Eymes,38,,,38431000AE0339,,,56,,,,,,,,,,1,,,,,,,,,,5.848979,45.256078
2023-523033,2023-10-20,000001,Vente en l'état futur d'achèvement,449000,,,,,,38431,Saint-Nazaire-les-Eymes,38,,,38431000AE0339,,,39,,,,,,,,,,1,,,,,,,,,,5.848979,45.256078
2023-523033,2023-10-20,000001,Vente en l'état futur d'achèvement,449000,,,,,,38431,Saint-Nazaire-les-Eymes,38,,,38431000AE0339,,,38,,,,,,,,,,1,,,,,,,,,,5.848979,45.256078
2023-523033,2023-10-20,000001,Vente en l'état futur d'achèvement,449000,,,,,,38431,Saint-Nazaire-les-Eymes,38,,,38431000AE0339,,,79,,,,,,,,,,1,,,,,,,,,,5.848979,45.256078
2023-523636,2023-12-08,000001,Vente en l'état futur d'achèvement,247400,,,,,,38431,Saint-Nazaire-les-Eymes,38,,,38431000AE0339,,,55,,,,,,,,,,1,,,,,,,,,,5.848979,45.256078
2023-523636,2023-12-08,000001,Vente en l'état futur d'achèvement,247400,,,,,,38431,Saint-Nazaire-les-Eymes,38,,,38431000AE0339,,,86,,,,,,,,,,1,,,,,,,,,,5.848979,45.256078
2023-523636,2023-12-08,000001,Vente en l'état futur d'achèvement,247400,,,,,,38431,Saint-Nazaire-les-Eymes,38,,,38431000AE0339,,,32,,,,,,,,,,1,,,,,,,,,,5.848979,45.256078
2023-523854,2023-12-21,000001,Vente,300000,720,,CHE DE LA MAIRIE,0215,38330,38431,Saint-Nazaire-les-Eymes,38,,,38431000AI0190,,,10,69.66,,,,,,,,,1,2,Appartement,69,3,,,,,,5.850732,45.251647
2023-523854,2023-12-21,000001,Vente,300000,720,,CHE DE LA MAIRIE,0215,38330,38431,Saint-Nazaire-les-Eymes,38,,,38431000AI0190,,,30,,,,,,,,,,1,3,Dépendance,,0,,,,,,5.850732,45.251647
