id_mutation,date_mutation,numero_disposition,nature_mutation,valeur_fonciere,adresse_numero,adresse_suffixe,adresse_nom_voie,adresse_code_voie,code_postal,code_commune,nom_commune,code_departement,ancien_code_commune,ancien_nom_commune,id_parcelle,ancien_id_parcelle,numero_volume,lot1_numero,lot1_surface_carrez,lot2_numero,lot2_surface_carrez,lot3_numero,lot3_surface_carrez,lot4_numero,lot4_surface_carrez,lot5_numero,lot5_surface_carrez,nombre_lots,code_type_local,type_local,surface_reelle_bati,nombre_pieces_principales,code_nature_culture,nature_culture,code_nature_culture_speciale,nature_culture_speciale,surface_terrain,longitude,latitude
2023-576566,2023-01-23,000002,Vente,103.5,,,BOIS DE BOREY,B007,43170,43029,La Besseyre-Saint-Mary,43,,,430290000E0844,,,,,,,,,,,,,0,,,,,PA,pâtures,,,230,,
2023-577495,2023-02-27,000001,Vente,61680,5070,,POMPEYRIN,B107,43170,43029,La Besseyre-Saint-Mary,43,,,430290000D0470,,,,,,,,,,,,,0,3,Dépendance,,0,S,sols,,,676,3.422833,44.961455
2023-577495,2023-02-27,000001,Vente,61680,5070,,POMPEYRIN,B107,43170,43029,La Besseyre-Saint-Mary,43,,,430290000D0470,,,,,,,,,,,,,0,1,Maison,48,2,S,sols,,,676,3.422833,44.961455
2023-577495,2023-02-27,000001,Vente,61680,5070,,POMPEYRIN,B107,43170,43029,La Besseyre-Saint-Mary,43,,,430290000D0470,,,,,,,,,,,,,0,1,Maison,15,1,S,sols,,,676,3.422833,44.961455
2023-577495,2023-02-27,000001,Vente,61680,,,POMPEYRIN,B107,43170,43029,La Besseyre-Saint-Mary,43,,,430290000D0472,,,,,,,,,,,,,0,,,,,S,sols,,,96,3.422603,44.961381
2023-578353,2023-04-04,000001,Vente,43000,,,FONTSECHE,B069,43170,43029,La Besseyre-Saint-Mary,43,,,430290000B0155,,,,,,,,,,,,,0,,,,,BR,futaies résineuses,SAPIN,Sapins ou sapinière,5000,3.421209,44.983138
2023-578353,2023-04-04,000001,Vente,43000,,,FONTSECHE,B069,43170,43029,La Besseyre-Saint-Mary,43,,,430290000B0155,,,,,,,,,,,,,0,,,,,BR,futaies résineuses,SAPIN,Sapins ou sapinière,5006,3.421209,44.983138
2023-578353,2023-04-04,000001,Vente,43000,,,FONTSECHE,B069,43170,43029,La Besseyre-Saint-Mary,43,,,430290000B0162,,,,,,,,,,,,,0,,,,,BR,futaies résineuses,PIN,Pins,784,3.423224,44.982065
2023-578353,2023-04-04,000001,Vente,43000,,,FONTSECHE,B069,43170,43029,La Besseyre-Saint-Mary,43,,,430290000B0472,,,,,,,,,,,,,0,,,,,BR,futaies résineuses,SAPIN,Sapins ou sapinière,20000,3.419434,44.981852
2023-578353,2023-04-04,000001,Vente,43000,,,FONTSECHE,B069,43170,43029,La Besseyre-Saint-Mary,43,,,430290000B0472,,,,,,,,,,,,,0,,,,,BR,futaies résineuses,PIN,Pins,11034,3.419434,44.981852
2023-578353,2023-04-04,000001,Vente,43000,,,LA GRAILLE,B073,43170,43029,La Besseyre-Saint-Mary,43,,,430290000C0024,,,,,,,,,,,,,0,,,,,BR,futaies résineuses,SAPIN,Sapins ou sapinière,24426,3.42796,44.971222
2023-578462,2023-04-13,000002,Vente,100,,,POMPEYRIN,B107,43170,43029,La Besseyre-Saint-Mary,43,,,430290000D0625,,,,,,,,,,,,,0,,,,,L,landes,,,58,3.421689,44.962348
2023-578469,2023-04-13,000001,Vente,1500,,,LA GRAILLE,B073,43170,43029,La Besseyre-Saint-Mary,43,,,430290000C0022,,,,,,,,,,,,,0,,,,,BR,futaies résineuses,PIN,Pins,2772,3.427055,44.970836
2023-578469,2023-04-13,000001,Vente,1500,,,LA CROUZETTE,B049,43170,43029,La Besseyre-Saint-Mary,43,,,430290000C0270,,,,,,,,,,,,,0,,,,,BR,futaies résineuses,PIN,Pins,1963,3.432449,44.961981
2023-578469,2023-04-13,000001,Vente,1500,,,BOREGARD,B011,43170,43029,La Besseyre-Saint-Mary,43,,,430290000C0353,,,,,,,,,,,,,0,,,,,BR,futaies résineuses,PIN,Pins,4030,3.42456,44.957353
2023-578581,2023-05-04,000001,Vente,750,,,PONTARY,B108,43170,43029,La Besseyre-Saint-Mary,43,,,430290000D0522,,,,,,,,,,,,,0,,,,,BR,futaies résineuses,PIN,Pins,1553,3.401652,44.959653
2023-579228,2023-05-22,000001,Vente,270.8,,,LE FAUT,B064,43170,43029,La Besseyre-Saint-Mary,43,,,430290000D0619,,,,,,,,,,,,,0,,,,,L,landes,,,32,3.417384,44.962219
2023-579228,2023-05-22,000001,Vente,270.8,,,LE FAUT,B064,43170,43029,La Besseyre-Saint-Mary,43,,,430290000D0621,,,,,,,,,,,,,0,,,,,T,terres,,,323,3.417131,44.962191
2023-579228,2023-05-22,000001,Vente,270.8,,,LE FAUT,B064,43170,43029,La Besseyre-Saint-Mary,43,,,430290000D0623,,,,,,,,,,,,,0,,,,,T,terres,,,261,3.416575,44.962034
2023-579489,2023-06-07,000001,Vente,40000,,,LA SAUGNE,B129,43170,43029,La Besseyre-Saint-Mary,43,,,430290000C0287,,,,,,,,,,,,,0,,,,,BR,futaies résineuses,SAPIN,Sapins ou sapinière,6887,3.431797,44.950992
2023-579489,2023-06-07,000001,Vente,40000,,,PATURAL DE LA CHAUME,B098,43170,43029,La Besseyre-Saint-Mary,43,,,430290000C0289,,,,,,,,,,,,,0,,,,,BR,futaies résineuses,SAPIN,Sapins ou sapinière,7144,3.43174,44.949597
2023-579489,2023-06-07,000001,Vente,40000,,,PRADET,B110,43170,43029,La Besseyre-Saint-Mary,43,,,430290000C0446,,,,,,,,,,,,,0,,,,,L,landes,,,680,3.425912,44.955087
2023-579489,2023-06-07,000001,Vente,40000,,,LA SAUGNE,B129,43170,43029,La Besseyre-Saint-Mary,43,,,430290000C0531,,,,,,,,,,,,,0,,,,,BT,taillis simples,,,10543,3.431062,44.950567
2023-579489,2023-06-07,000001,Vente,40000,,,PRADET,B110,43170,43029,La Besseyre-Saint-Mary,43,,,430290000C0574,,,,,,,,,,,,,0,,,,,S,sols,,,637,3.425081,44.953994
2023-579489,2023-06-07,000001,Vente,40000,,,PRADET,B110,43170,43029,La Besseyre-Saint-Mary,43,,,430290000C0583,,,,,,,,,,,,,0,,,,,S,sols,,,1500,3.42506,44.954654
2023-579489,2023-06-07,000001,Vente,40000,,,PRADET,B110,43170,43029,La Besseyre-Saint-Mary,43,,,430290000C0583,,,,,,,,,,,,,0,,,,,T,terres,,,10738,3.42506,44.954654
2023-579489,2023-06-07,000001,Vente,40000,,,PRADET,B110,43170,43029,La Besseyre-Saint-Mary,43,,,430290000C0583,,,,,,,,,,,,,0,,,,,T,terres,,,4080,3.42506,44.954654
2023-579489,2023-06-07,000001,Vente,40000,,,PRADET,B110,43170,43029,La Besseyre-Saint-Mary,43,,,430290000C0623,,,,,,,,,,,,,0,,,,,T,terres,,,2118,3.426632,44.954176
2023-580848,2023-08-11,000001,Vente,50000,,,CHAMBLARD,B021,43170,43029,La Besseyre-Saint-Mary,43,,,430290000B0269,,,,,,,,,,,,,0,,,,,BR,futaies résineuses,SAPIN,Sapins ou sapinière,32780,3.434022,44.981916
2023-580848,2023-08-11,000001,Vente,50000,,,CHAMBLARD,B021,43170,43029,La Besseyre-Saint-Mary,43,,,430290000B0269,,,,,,,,,,,,,0,,,,,BR,futaies résineuses,SAPIN,Sapins ou sapinière,50000,3.434022,44.981916
2023-581494,2023-09-21,000002,Vente,2500,,,CHAMBAUNET,B020,43170,43029,La Besseyre-Saint-Mary,43,,,430290000D0627,,,,,,,,,,,,,0,,,,,P,prés,,,1247,3.412437,44.96569
2023-581528,2023-09-20,000001,Echange,1800,,,CHAMP DU RIOUX,B030,43170,43029,La Besseyre-Saint-Mary,43,,,430290000C0038,,,,,,,,,,,,,0,,,,,PA,pâtures,,,4999,3.429798,44.96836
2023-581528,2023-09-20,000001,Echange,1800,,,CHAMP DU RIOUX,B030,43170,43029,La Besseyre-Saint-Mary,43,,,430290000C0039,,,,,,,,,,,,,0,,,,,P,prés,,,2890,3.429017,44.968348
2023-581528,2023-09-20,000001,Echange,1800,,,CHAMP DU RIOUX,B030,43170,43029,La Besseyre-Saint-Mary,43,,,430290000C0046,,,,,,,,,,,,,0,,,,,T,terres,,,9225,3.427013,44.96661
2023-581528,2023-09-20,000001,Echange,1800,,,CHAMP DU RIOUX,B030,43170,43029,La Besseyre-Saint-Mary,43,,,430290000C0047,,,,,,,,,,,,,0,,,,,P,prés,,,1044,3.42718,44.965724
2023-581528,2023-09-20,000001,Echange,1800,,,CHAMP DU RIOUX,B030,43170,43029,La Besseyre-Saint-Mary,43,,,430290000C0055,,,,,,,,,,,,,0,,,,,T,terres,,,4619,3.429546,44.966046
2023-581528,2023-09-20,000001,Echange,1800,,,PRAT LONG,B114,43170,43029,La Besseyre-Saint-Mary,43,,,430290000C0157,,,,,,,,,,,,,0,,,,,P,prés,,,1376,3.42432,44.966732
2023-581528,2023-09-20,000002,Echange,1800,,,LE BUISSON,B018,43170,43029,La Besseyre-Saint-Mary,43,,,430290000C0235,,,,,,,,,,,,,0,,,,,P,prés,,,5701,3.428422,44.957365
2023-581528,2023-09-20,000002,Echange,1800,,,LE BUISSON,B018,43170,43029,La Besseyre-Saint-Mary,43,,,430290000C0235,,,,,,,,,,,,,0,,,,,P,prés,,,5700,3.428422,44.957365
2023-581528,2023-09-20,000002,Echange,1800,,,PRE GRAND,B118,43170,43029,La Besseyre-Saint-Mary,43,,,430290000C0325,,,,,,,,,,,,,0,,,,,P,prés,,,1656,3.429249,44.957173
2023-581528,2023-09-20,000002,Echange,1800,,,CHAMP DE SEPTSOLS,B026,43170,43029,La Besseyre-Saint-Mary,43,,,430290000C0421,,,,,,,,,,,,,0,,,,,T,terres,,,2039,3.425985,44.957263
2023-581528,2023-09-20,000002,Echange,1800,,,CHAMP DE SEPTSOLS,B026,43170,43029,La Besseyre-Saint-Mary,43,,,430290000C0421,,,,,,,,,,,,,0,,,,,T,terres,,,2039,3.425985,44.957263
2023-581528,2023-09-20,000002,Echange,1800,,,CHAMP DE SEPTSOLS,B026,43170,43029,La Besseyre-Saint-Mary,43,,,430290000C0428,,,,,,,,,,,,,0,,,,,T,terres,,,2245,3.426007,44.956799
2023-581528,2023-09-20,000002,Echange,1800,,,CHAMP DE SEPTSOLS,B026,43170,43029,La Besseyre-Saint-Mary,43,,,430290000C0429,,,,,,,,,,,,,0,,,,,P,prés,,,4152,3.426959,44.957212
2023-581528,2023-09-20,000002,Echange,1800,,,CHAMP DE SEPTSOLS,B026,43170,43029,La Besseyre-Saint-Mary,43,,,430290000C0431,,,,,,,,,,,,,0,,,,,T,terres,,,1463,3.426334,44.95661
