id_mutation,date_mutation,numero_disposition,nature_mutation,valeur_fonciere,adresse_numero,adresse_suffixe,adresse_nom_voie,adresse_code_voie,code_postal,code_commune,nom_commune,code_departement,ancien_code_commune,ancien_nom_commune,id_parcelle,ancien_id_parcelle,numero_volume,lot1_numero,lot1_surface_carrez,lot2_numero,lot2_surface_carrez,lot3_numero,lot3_surface_carrez,lot4_numero,lot4_surface_carrez,lot5_numero,lot5_surface_carrez,nombre_lots,code_type_local,type_local,surface_reelle_bati,nombre_pieces_principales,code_nature_culture,nature_culture,code_nature_culture_speciale,nature_culture_speciale,surface_terrain,longitude,latitude
2023-735398,2023-01-30,000001,Vente,300,,,LA BILLOTTE,B008,58190,58005,Amazy,58,,,58005000AC0050,,,,,,,,,,,,,0,,,,,T,terres,,,453,3.580436,47.375375
2023-735460,2023-01-27,000001,Vente,800,313,,LES BRICAUDES,B020,58190,58005,Amazy,58,,,58005000ZA0066,,,,,,,,,,,,,0,1,Maison,30,1,T,terres,,,381,3.548685,47.392862
2023-735476,2023-01-27,000001,Vente,41605.2,,,LES CHASSENOIS,B040,58190,58005,Amazy,58,,,580050000B0446,,,,,,,,,,,,,0,,,,,P,prés,,,31388,3.604256,47.38123
2023-735656,2023-02-04,000001,Vente,45000,,,LE BOURG,B016,58190,58005,Amazy,58,,,58005000AC0323,,,,,,,,,,,,,0,,,,,J,jardins,,,477,3.579173,47.378797
2023-735656,2023-02-04,000001,Vente,45000,5,,LE BOURG,B016,58190,58005,Amazy,58,,,58005000AC0324,,,,,,,,,,,,,0,1,Maison,125,5,S,sols,,,1682,3.578458,47.379076
2023-735656,2023-02-04,000001,Vente,45000,,,LE BOURG,B016,58190,58005,Amazy,58,,,58005000AC0325,,,,,,,,,,,,,0,,,,,S,sols,,,1033,3.578539,47.379302
2023-736936,2023-05-04,000001,Vente,1500,,,PRES DU CHAPITRE,B162,58190,58005,Amazy,58,,,580050000B0472,,,,,,,,,,,,,0,,,,,P,prés,,,8505,3.601951,47.381432
2023-737787,2023-06-10,000001,Vente,5000,,,SALIGNY,B183,58190,58005,Amazy,58,,,58005000AB0063,,,,,,,,,,,,,0,,,,,S,sols,,,57,3.552355,47.393716
2023-737787,2023-06-10,000001,Vente,5000,,,SALIGNY,B183,58190,58005,Amazy,58,,,58005000AB0052,,,,,,,,,,,,,0,,,,,S,sols,,,23,3.552243,47.393926
2023-737787,2023-06-10,000001,Vente,5000,138,,SALIGNY,B183,58190,58005,Amazy,58,,,58005000AB0053,,,,,,,,,,,,,0,1,Maison,24,1,S,sols,,,224,3.552156,47.393859
2023-737787,2023-06-10,000001,Vente,5000,,,SALIGNY,B183,58190,58005,Amazy,58,,,58005000AB0054,,,,,,,,,,,,,0,,,,,S,sols,,,45,3.552236,47.393824
2023-737787,2023-06-10,000001,Vente,5000,,,SALIGNY,B183,58190,58005,Amazy,58,,,58005000AB0174,,,,,,,,,,,,,0,,,,,J,jardins,,,131,3.551786,47.394251
2023-737787,2023-06-10,000001,Vente,5000,,,SALIGNY,B183,58190,58005,Amazy,58,,,58005000AB0176,,,,,,,,,,,,,0,,,,,J,jardins,,,137,3.551847,47.394189
2023-737787,2023-06-10,000001,Vente,5000,,,SALIGNY,B183,58190,58005,Amazy,58,,,58005000AB0178,,,,,,,,,,,,,0,,,,,J,jardins,,,267,3.551933,47.394155
2023-737787,2023-06-10,000001,Vente,5000,,,SALIGNY,B183,58190,58005,Amazy,58,,,58005000AB0180,,,,,,,,,,,,,0,,,,,J,jardins,,,202,3.552007,47.394224
2023-737787,2023-06-10,000001,Vente,5000,,,SALIGNY,B183,58190,58005,Amazy,58,,,58005000AB0182,,,,,,,,,,,,,0,,,,,P,prés,,,927,3.552142,47.394024
2023-738089,2023-06-14,000002,Vente,30000,,,LES NEUX,B125,58190,58005,Amazy,58,,,580050000B0396,,,,,,,,,,,,,0,,,,,P,prés,,,4225,3.60568,47.388507
2023-738121,2023-07-04,000001,Vente,300,,,SALIGNY,B183,58190,58005,Amazy,58,,,58005000AB0009,,,,,,,,,,,,,0,,,,,J,jardins,,,262,3.550838,47.39413
2023-738121,2023-07-04,000001,Vente,300,,,SALIGNY,B183,58190,58005,Amazy,58,,,58005000AB0010,,,,,,,,,,,,,0,,,,,T,terres,,,380,3.55076,47.394074
2023-738652,2023-08-02,000001,Vente,4000,,,LE BOURG,B016,58190,58005,Amazy,58,,,58005000AC0114,,,,,,,,,,,,,0,,,,,S,sols,,,320,3.57772,47.37591
2023-738652,2023-08-02,000001,Vente,4000,,,LE BOURG,B016,58190,58005,Amazy,58,,,58005000AC0115,,,,,,,,,,,,,0,,,,,S,sols,,,70,3.577806,47.3759
2023-739033,2023-09-15,000001,Vente,30000,80,,LE BOURG,B016,58190,58005,Amazy,58,,,58005000AC0077,,,,,,,,,,,,,0,1,Maison,42,1,S,sols,,,230,3.578503,47.373352
2023-739033,2023-09-15,000001,Vente,30000,,,LE BOURG,B016,58190,58005,Amazy,58,,,58005000AC0432,,,,,,,,,,,,,0,,,,,J,jardins,,,172,3.578283,47.37333
2023-739659,2023-10-19,000001,Vente,2000,,,LE BOURG,B016,58190,58005,Amazy,58,,,58005000AC0317,,,,,,,,,,,,,0,,,,,T,terres,,,200,3.577745,47.377541
2023-739890,2023-11-08,000002,Vente,20000,,,CHEVANNES,B048,58190,58005,Amazy,58,,,580050000B0569,,,,,,,,,,,,,0,,,,,S,sols,,,792,3.588551,47.385961
2023-740197,2023-11-17,000001,Vente,25000,109,,PINCENET,B140,58190,58005,Amazy,58,,,580050000A1086,,,,,,,,,,,,,0,1,Maison,45,3,S,sols,,,463,3.550788,47.402639
2023-740218,2023-11-24,000001,Vente,16000,,,LE BOURG,B016,58190,58005,Amazy,58,,,58005000AC0167,,,,,,,,,,,,,0,,,,,S,sols,,,109,3.578132,47.374476
2023-740218,2023-11-24,000001,Vente,16000,69,,LE BOURG,B016,58190,58005,Amazy,58,,,58005000AC0168,,,,,,,,,,,,,0,3,Dépendance,,0,S,sols,,,58,3.578203,47.374388
2023-740218,2023-11-24,000001,Vente,16000,68,,LE BOURG,B016,58190,58005,Amazy,58,,,58005000AC0170,,,,,,,,,,,,,0,1,Maison,34,1,S,sols,,,84,3.578201,47.374273
2023-740218,2023-11-24,000001,Vente,16000,,,LE BOURG,B016,58190,58005,Amazy,58,,,58005000AC0361,,,,,,,,,,,,,0,,,,,S,sols,,,5,3.578205,47.374319
2023-740228,2023-11-09,000001,Vente,4500,,,LA COTE DES PIERRES,B056,58190,58005,Amazy,58,,,580050000A0403,,,,,,,,,,,,,0,,,,,L,landes,,,2430,3.564751,47.396099
