id_mutation,date_mutation,numero_disposition,nature_mutation,valeur_fonciere,adresse_numero,adresse_suffixe,adresse_nom_voie,adresse_code_voie,code_postal,code_commune,nom_commune,code_departement,ancien_code_commune,ancien_nom_commune,id_parcelle,ancien_id_parcelle,numero_volume,lot1_numero,lot1_surface_carrez,lot2_numero,lot2_surface_carrez,lot3_numero,lot3_surface_carrez,lot4_numero,lot4_surface_carrez,lot5_numero,lot5_surface_carrez,nombre_lots,code_type_local,type_local,surface_reelle_bati,nombre_pieces_principales,code_nature_culture,nature_culture,code_nature_culture_speciale,nature_culture_speciale,surface_terrain,longitude,latitude
2023-735775,2023-02-21,000001,Vente,2300,,,LA BUSSIERE,B007,58500,58073,Chevroches,58,,,58073000ZA0024,,,,,,,,,,,,,0,,,,,T,terres,,,4660,3.544097,47.452333
2023-735775,2023-02-21,000001,Vente,2300,,,LA BUSSIERE,B007,58500,58073,Chevroches,58,,,58073000ZA0024,,,,,,,,,,,,,0,,,,,T,terres,,,2330,3.544097,47.452333
2023-735819,2023-02-21,000001,Vente,67000,,,LE BOURG,B004,58500,58073,Chevroches,58,,,580730000A0332,,,,,,,,,,,,,0,,,,,P,prés,,,710,3.546337,47.447335
2023-735819,2023-02-21,000001,Vente,67000,36,,LE BOURG,B004,58500,58073,Chevroches,58,,,580730000A0333,,,,,,,,,,,,,0,1,Maison,99,4,S,sols,,,550,3.546432,47.447617
2023-735819,2023-02-21,000001,Vente,67000,,,LE BOURG,B004,58500,58073,Chevroches,58,,,580730000A0334,,,,,,,,,,,,,0,,,,,S,sols,,,135,3.546551,47.447684
2023-735819,2023-02-21,000001,Vente,67000,,,LE BOURG,B004,58500,58073,Chevroches,58,,,580730000A0335,,,,,,,,,,,,,0,,,,,J,jardins,,,405,3.546688,47.447689
2023-735819,2023-02-21,000001,Vente,67000,,,LE BOURG,B004,58500,58073,Chevroches,58,,,580730000A0336,,,,,,,,,,,,,0,,,,,J,jardins,,,160,3.546816,47.447727
2023-737626,2023-06-16,000001,Vente,44000,61,,LE BOURG,B004,58500,58073,Chevroches,58,,,580730000A0284,,,,,,,,,,,,,0,1,Maison,130,6,S,sols,,,160,3.543251,47.44917
2023-737626,2023-06-16,000001,Vente,44000,61,,LE BOURG,B004,58500,58073,Chevroches,58,,,580730000A0284,,,,,,,,,,,,,0,3,Dépendance,,0,S,sols,,,160,3.543251,47.44917
2023-737626,2023-06-16,000001,Vente,44000,,,LE BOURG,B004,58500,58073,Chevroches,58,,,580730000A0312,,,,,,,,,,,,,0,,,,,S,sols,,,155,3.543006,47.449024
2023-738038,2023-06-21,000002,Vente,200,,,LE CHAMP DES PRES,B010,58500,58073,Chevroches,58,,,580730000A0937,,,,,,,,,,,,,0,,,,,P,prés,,,646,3.548133,47.447909
2023-738896,2023-09-02,000001,Vente,125500,,,CHANTENOT,B016,58500,58073,Chevroches,58,,,580730000A0737,,,,,,,,,,,,,0,,,,,J,jardins,,,360,3.550406,47.444832
2023-738896,2023-09-02,000001,Vente,125500,,,CHANTENOT,B016,58500,58073,Chevroches,58,,,580730000A0782,,,,,,,,,,,,,0,,,,,J,jardins,,,175,3.550291,47.444869
2023-738896,2023-09-02,000001,Vente,125500,78,,CHANTENOT,B016,58500,58073,Chevroches,58,,,580730000A0784,,,,,,,,,,,,,0,1,Maison,200,5,S,sols,,,993,3.54927,47.444905
