id_mutation,date_mutation,numero_disposition,nature_mutation,valeur_fonciere,adresse_numero,adresse_suffixe,adresse_nom_voie,adresse_code_voie,code_postal,code_commune,nom_commune,code_departement,ancien_code_commune,ancien_nom_commune,id_parcelle,ancien_id_parcelle,numero_volume,lot1_numero,lot1_surface_carrez,lot2_numero,lot2_surface_carrez,lot3_numero,lot3_surface_carrez,lot4_numero,lot4_surface_carrez,lot5_numero,lot5_surface_carrez,nombre_lots,code_type_local,type_local,surface_reelle_bati,nombre_pieces_principales,code_nature_culture,nature_culture,code_nature_culture_speciale,nature_culture_speciale,surface_terrain,longitude,latitude
2023-735214,2023-01-13,000001,Vente,161649,3,,RUE DE LA FOLIE,0175,58180,58160,Marzy,58,,,58160000AH0206,,,,,,,,,,,,,0,3,Dépendance,,0,AG,terrains d'agrément,,,1623,3.078631,47.009813
2023-735214,2023-01-13,000001,Vente,161649,3,,RUE DE LA FOLIE,0175,58180,58160,Marzy,58,,,58160000AH0206,,,,,,,,,,,,,0,3,Dépendance,,0,S,sols,,,3573,3.078631,47.009813
2023-735214,2023-01-13,000001,Vente,161649,3,,RUE DE LA FOLIE,0175,58180,58160,Marzy,58,,,58160000AH0206,,,,,,,,,,,,,0,1,Maison,99,3,S,sols,,,3573,3.078631,47.009813
2023-735214,2023-01-13,000001,Vente,161649,3,,RUE DE LA FOLIE,0175,58180,58160,Marzy,58,,,58160000AH0206,,,,,,,,,,,,,0,1,Maison,99,3,AG,terrains d'agrément,,,1623,3.078631,47.009813
2023-735214,2023-01-13,000001,Vente,161649,3,,RUE DE LA FOLIE,0175,58180,58160,Marzy,58,,,58160000AH0208,,,,,,,,,,,,,0,,,,,T,terres,,,314,3.079607,47.010183
2023-735355,2023-01-24,000001,Vente,5000,,,LES VIGNOLLES,B220,58180,58160,Marzy,58,,,58160000AW0008,,,,,,,,,,,,,0,,,,,T,terres,,,3385,3.090988,46.991617
2023-735357,2023-01-10,000001,Vente,300000,28,,RUE DE LA CROIX SAINT ETIENNE,0120,58180,58160,Marzy,58,,,58160000BR0045,,,,,,,,,,,,,0,1,Maison,112,4,S,sols,,,1000,3.084452,46.987999
2023-735357,2023-01-10,000001,Vente,300000,28,,RUE DE LA CROIX SAINT ETIENNE,0120,58180,58160,Marzy,58,,,58160000BR0045,,,,,,,,,,,,,0,1,Maison,112,4,J,jardins,,,3191,3.084452,46.987999
2023-735357,2023-01-10,000001,Vente,300000,,,LES PETITES LUMIERES,B149,58180,58160,Marzy,58,,,58160000BR0046,,,,,,,,,,,,,0,,,,,T,terres,,,1091,3.08443,46.988594
2023-735357,2023-01-10,000001,Vente,300000,,,LES PETITES LUMIERES,B149,58180,58160,Marzy,58,,,58160000BR0047,,,,,,,,,,,,,0,,,,,T,terres,,,977,3.084499,46.988763
2023-735664,2023-02-16,000001,Vente,125000,18,,RUE DE LA FONTAINE,0180,58180,58160,Marzy,58,,,58160000AN0018,,,,,,,,,,,,,0,1,Maison,108,4,S,sols,,,330,3.086635,46.996656
2023-735664,2023-02-16,000001,Vente,125000,18,,RUE DE LA FONTAINE,0180,58180,58160,Marzy,58,,,58160000AN0018,,,,,,,,,,,,,0,3,Dépendance,,0,S,sols,,,330,3.086635,46.996656
2023-735747,2023-02-14,000001,Vente,337700,4,B,RTE DE BUSSEROLLES,0045,58180,58160,Marzy,58,,,58160000BI0065,,,,,,,,,,,,,0,1,Maison,144,5,S,sols,,,1432,3.096883,46.980732
2023-735747,2023-02-14,000001,Vente,337700,4,B,RTE DE BUSSEROLLES,0045,58180,58160,Marzy,58,,,58160000BI0065,,,,,,,,,,,,,0,3,Dépendance,,0,J,jardins,,,1351,3.096883,46.980732
2023-735747,2023-02-14,000001,Vente,337700,4,B,RTE DE BUSSEROLLES,0045,58180,58160,Marzy,58,,,58160000BI0065,,,,,,,,,,,,,0,3,Dépendance,,0,J,jardins,,,1351,3.096883,46.980732
2023-735747,2023-02-14,000001,Vente,337700,4,B,RTE DE BUSSEROLLES,0045,58180,58160,Marzy,58,,,58160000BI0065,,,,,,,,,,,,,0,3,Dépendance,,0,S,sols,,,1432,3.096883,46.980732
2023-735747,2023-02-14,000001,Vente,337700,4,B,RTE DE BUSSEROLLES,0045,58180,58160,Marzy,58,,,58160000BI0065,,,,,,,,,,,,,0,1,Maison,144,5,J,jardins,,,1351,3.096883,46.980732
2023-735747,2023-02-14,000001,Vente,337700,4,B,RTE DE BUSSEROLLES,0045,58180,58160,Marzy,58,,,58160000BI0065,,,,,,,,,,,,,0,3,Dépendance,,0,S,sols,,,1432,3.096883,46.980732
2023-735913,2023-03-01,000001,Vente,565000,24,,RTE DE CORCELLES,0107,58180,58160,Marzy,58,,,58160000BK0001,,,,,,,,,,,,,0,1,Maison,126,8,AG,terrains d'agrément,,,1772,3.084811,46.982627
2023-735913,2023-03-01,000001,Vente,565000,24,,RTE DE CORCELLES,0107,58180,58160,Marzy,58,,,58160000BK0001,,,,,,,,,,,,,0,3,Dépendance,,0,T,terres,,,3103,3.084811,46.982627
2023-735913,2023-03-01,000001,Vente,565000,24,,RTE DE CORCELLES,0107,58180,58160,Marzy,58,,,58160000BK0001,,,,,,,,,,,,,0,3,Dépendance,,0,T,terres,,,3103,3.084811,46.982627
2023-735913,2023-03-01,000001,Vente,565000,24,,RTE DE CORCELLES,0107,58180,58160,Marzy,58,,,58160000BK0001,,,,,,,,,,,,,0,3,Dépendance,,0,S,sols,,,2140,3.084811,46.982627
2023-735913,2023-03-01,000001,Vente,565000,24,,RTE DE CORCELLES,0107,58180,58160,Marzy,58,,,58160000BK0001,,,,,,,,,,,,,0,1,Maison,126,8,S,sols,,,2140,3.084811,46.982627
2023-735913,2023-03-01,000001,Vente,565000,24,,RTE DE CORCELLES,0107,58180,58160,Marzy,58,,,58160000BK0001,,,,,,,,,,,,,0,3,Dépendance,,0,AG,terrains d'agrément,,,1772,3.084811,46.982627
2023-735913,2023-03-01,000001,Vente,565000,24,,RTE DE CORCELLES,0107,58180,58160,Marzy,58,,,58160000BK0001,,,,,,,,,,,,,0,3,Dépendance,,0,AG,terrains d'agrément,,,1772,3.084811,46.982627
2023-735913,2023-03-01,000001,Vente,565000,24,,RTE DE CORCELLES,0107,58180,58160,Marzy,58,,,58160000BK0001,,,,,,,,,,,,,0,3,Dépendance,,0,AG,terrains d'agrément,,,1772,3.084811,46.982627
2023-735913,2023-03-01,000001,Vente,565000,24,,RTE DE CORCELLES,0107,58180,58160,Marzy,58,,,58160000BK0001,,,,,,,,,,,,,0,1,Maison,126,8,T,terres,,,3103,3.084811,46.982627
2023-735913,2023-03-01,000001,Vente,565000,24,,RTE DE CORCELLES,0107,58180,58160,Marzy,58,,,58160000BK0001,,,,,,,,,,,,,0,3,Dépendance,,0,T,terres,,,3103,3.084811,46.982627
2023-735913,2023-03-01,000001,Vente,565000,24,,RTE DE CORCELLES,0107,58180,58160,Marzy,58,,,58160000BK0001,,,,,,,,,,,,,0,3,Dépendance,,0,S,sols,,,2140,3.084811,46.982627
2023-735913,2023-03-01,000001,Vente,565000,24,,RTE DE CORCELLES,0107,58180,58160,Marzy,58,,,58160000BK0001,,,,,,,,,,,,,0,3,Dépendance,,0,S,sols,,,2140,3.084811,46.982627
2023-735913,2023-03-01,000001,Vente,565000,,,LE PETIT MONCEAU,B147,58180,58160,Marzy,58,,,58160000BK0295,,,,,,,,,,,,,0,,,,,AB,terrains a bâtir,,,1537,3.085585,46.982934
2023-735915,2023-02-17,000001,Vente,155000,14,,IMP MATHIEU,0240,58180,58160,Marzy,58,,,58160000AH0119,,,,,,,,,,,,,0,1,Maison,80,5,S,sols,,,1099,3.081264,47.005601
2023-735915,2023-02-17,000001,Vente,155000,14,,IMP MATHIEU,0240,58180,58160,Marzy,58,,,58160000AH0119,,,,,,,,,,,,,0,3,Dépendance,,0,S,sols,,,1099,3.081264,47.005601
2023-735915,2023-02-17,000001,Vente,155000,14,,IMP MATHIEU,0240,58180,58160,Marzy,58,,,58160000AH0119,,,,,,,,,,,,,0,3,Dépendance,,0,S,sols,,,1099,3.081264,47.005601
2023-735995,2023-02-28,000001,Vente,265050,10,,IMP BELLEVUE,0420,58180,58160,Marzy,58,,,58160000BO0265,,,,,,,,,,,,,0,1,Maison,122,4,S,sols,,,1184,3.08961,46.987346
2023-735995,2023-02-28,000001,Vente,265050,10,,IMP BELLEVUE,0420,58180,58160,Marzy,58,,,58160000BO0265,,,,,,,,,,,,,0,3,Dépendance,,0,S,sols,,,1184,3.08961,46.987346
2023-735995,2023-02-28,000001,Vente,265050,10,,IMP BELLEVUE,0420,58180,58160,Marzy,58,,,58160000BO0265,,,,,,,,,,,,,0,3,Dépendance,,0,S,sols,,,1184,3.08961,46.987346
2023-736240,2023-03-17,000001,Vente,191000,66,,AV DUFAUD,0140,58180,58160,Marzy,58,,,58160000AH0038,,,,,,,,,,,,,0,1,Maison,84,5,S,sols,,,541,3.081015,47.009745
2023-736360,2023-03-02,000001,Vente,196500,5,,CHE DU MONCEAU,0265,58180,58160,Marzy,58,,,58160000BK0033,,,,,,,,,,,,,0,3,Dépendance,,0,S,sols,,,717,3.08754,46.981363
2023-736360,2023-03-02,000001,Vente,196500,5,,CHE DU MONCEAU,0265,58180,58160,Marzy,58,,,58160000BK0033,,,,,,,,,,,,,0,3,Dépendance,,0,S,sols,,,717,3.08754,46.981363
2023-736360,2023-03-02,000001,Vente,196500,5,,CHE DU MONCEAU,0265,58180,58160,Marzy,58,,,58160000BK0033,,,,,,,,,,,,,0,1,Maison,184,10,S,sols,,,717,3.08754,46.981363
2023-736397,2023-03-13,000001,Vente,265000,22,,RUE DES CHEVRES,0100,58180,58160,Marzy,58,,,58160000BL0013,,,,,,,,,,,,,0,1,Maison,120,5,J,jardins,,,1032,3.083047,46.978075
2023-736397,2023-03-13,000001,Vente,265000,22,,RUE DES CHEVRES,0100,58180,58160,Marzy,58,,,58160000BL0013,,,,,,,,,,,,,0,1,Maison,120,5,S,sols,,,1400,3.083047,46.978075
2023-736412,2023-03-30,000001,Vente,104000,31,,AV DU CHASNAY,0085,58180,58160,Marzy,58,,,58160000AH0108,,,,,,,,,,,,,0,1,Maison,66,3,S,sols,,,800,3.0827,47.006647
2023-736412,2023-03-30,000001,Vente,104000,31,,AV DU CHASNAY,0085,58180,58160,Marzy,58,,,58160000AH0108,,,,,,,,,,,,,0,1,Maison,66,3,J,jardins,,,703,3.0827,47.006647
2023-736527,2023-03-22,000002,Vente,1800,,,LE CLOS MONCEAU,B080,58180,58160,Marzy,58,,,58160000BN0077,,,,,,,,,,,,,0,,,,,L,landes,PACAG,Pacage,84,3.084814,46.982111
2023-736562,2023-03-31,000001,Vente,150000,76,B,RTE DE NEVERS,0275,58180,58160,Marzy,58,,,58160000AI0087,,,,,,,,,,,,,0,4,Local industriel. commercial ou assimilé,675,0,S,sols,,,1864,3.08981,47.010441
2023-737249,2023-05-17,000001,Vente,5000,18,,RTE DE MARCE,0231,58180,58160,Marzy,58,,,58160000AW0028,,,,,,,,,,,,,0,,,,,T,terres,,,3937,3.096674,46.991169
2023-737326,2023-05-31,000002,Vente,1000,,,LES CHAPONS,B067,58180,58160,Marzy,58,,,58160000BT0146,,,,,,,,,,,,,0,,,,,P,prés,,,2380,3.077139,46.992567
2023-737361,2023-05-26,000002,Vente,4000,19,,CHEM DU MAGNY,0227,58180,58160,Marzy,58,,,58160000AR0072,,,,,,,,,,,,,0,,,,,S,sols,,,29,3.103938,47.003203
2023-738115,2023-07-07,000001,Vente,250000,36,,RUE DE LA CROIX SAINT ETIENNE,0120,58180,58160,Marzy,58,,,58160000BR0141,,,,,,,,,,,,,0,1,Maison,101,4,S,sols,,,1327,3.082664,46.98764
2023-738115,2023-07-07,000001,Vente,250000,,,LES PETITES LUMIERES,B149,58180,58160,Marzy,58,,,58160000BR0143,,,,,,,,,,,,,0,,,,,T,terres,,,222,3.08259,46.987526
2023-738126,2023-06-26,000001,Vente,169000,4,,RUE DE LA CAYUELLE,0065,58180,58160,Marzy,58,,,58160000BS0022,,,,,,,,,,,,,0,1,Maison,94,4,S,sols,,,1008,3.08939,46.994035
2023-738377,2023-07-27,000001,Vente,127000,58,,AV DUFAUD,0140,58180,58160,Marzy,58,,,58160000AH0042,,,,,,,,,,,,,0,1,Maison,72,3,S,sols,,,500,3.080889,47.008971
2023-738387,2023-07-27,000002,Vente terrain à bâtir,907.5,164,,RTE DE NEVERS,0275,58180,58160,Marzy,58,,,58160000AP0052,,,,,,,,,,,,,0,,,,,S,sols,,,121,3.099188,47.001258
2023-738388,2023-07-27,000001,Vente,275000,7,,RUE DES MESANGES,0243,58180,58160,Marzy,58,,,58160000BO0236,,,,,,,,,,,,,0,1,Maison,164,5,S,sols,,,1157,3.086555,46.984341
2023-738393,2023-07-31,000001,Vente,110000,12,,LE PETIT MONCEAU,B147,58180,58160,Marzy,58,,,58160000BK0076,,,,,,,,,,,,,0,1,Maison,88,4,S,sols,,,576,3.088346,46.98221
2023-738540,2023-08-01,000001,Vente,360000,45,,RTE DE CORCELLES,0107,58180,58160,Marzy,58,,,58160000BP0105,,,,,,,,,,,,,0,3,Dépendance,,0,T,terres,,,3984,3.07913,46.985759
2023-738540,2023-08-01,000001,Vente,360000,45,,RTE DE CORCELLES,0107,58180,58160,Marzy,58,,,58160000BP0105,,,,,,,,,,,,,0,1,Maison,147,6,S,sols,,,1000,3.07913,46.985759
2023-738540,2023-08-01,000001,Vente,360000,45,,RTE DE CORCELLES,0107,58180,58160,Marzy,58,,,58160000BP0105,,,,,,,,,,,,,0,1,Maison,147,6,T,terres,,,3984,3.07913,46.985759
2023-738540,2023-08-01,000001,Vente,360000,45,,RTE DE CORCELLES,0107,58180,58160,Marzy,58,,,58160000BP0105,,,,,,,,,,,,,0,3,Dépendance,,0,T,terres,,,3984,3.07913,46.985759
2023-738540,2023-08-01,000001,Vente,360000,45,,RTE DE CORCELLES,0107,58180,58160,Marzy,58,,,58160000BP0105,,,,,,,,,,,,,0,3,Dépendance,,0,S,sols,,,1000,3.07913,46.985759
2023-738540,2023-08-01,000001,Vente,360000,45,,RTE DE CORCELLES,0107,58180,58160,Marzy,58,,,58160000BP0105,,,,,,,,,,,,,0,3,Dépendance,,0,S,sols,,,1000,3.07913,46.985759
2023-738743,2023-08-24,000001,Vente,157000,,,RTE DE CORCELLES,0107,58180,58160,Marzy,58,,,58160000BV0346,,,,,,,,,,,,,0,,,,,T,terres,,,167,3.079267,46.996163
2023-738743,2023-08-24,000001,Vente,157000,118,A,RTE DE CORCELLES,0107,58180,58160,Marzy,58,,,58160000BV0349,,,,,,,,,,,,,0,1,Maison,87,4,S,sols,,,714,3.079069,46.99601
2023-738767,2023-08-02,000001,Vente,585000,,,LES MOUREZ,B141,58180,58160,Marzy,58,,,58160000BM0019,,,,,,,,,,,,,0,,,,,T,terres,,,979,3.073608,46.974253
2023-738767,2023-08-02,000001,Vente,585000,20,,RUE DES MOUREZ,0270,58180,58160,Marzy,58,,,58160000BM0020,,,,,,,,,,,,,0,3,Dépendance,,0,S,sols,,,1000,3.074171,46.974366
2023-738767,2023-08-02,000001,Vente,585000,20,,RUE DES MOUREZ,0270,58180,58160,Marzy,58,,,58160000BM0020,,,,,,,,,,,,,0,1,Maison,282,6,S,sols,,,1000,3.074171,46.974366
2023-738767,2023-08-02,000001,Vente,585000,20,,RUE DES MOUREZ,0270,58180,58160,Marzy,58,,,58160000BM0020,,,,,,,,,,,,,0,3,Dépendance,,0,J,jardins,,,1842,3.074171,46.974366
2023-738767,2023-08-02,000001,Vente,585000,20,,RUE DES MOUREZ,0270,58180,58160,Marzy,58,,,58160000BM0020,,,,,,,,,,,,,0,1,Maison,282,6,J,jardins,,,1842,3.074171,46.974366
2023-738767,2023-08-02,000001,Vente,585000,20,,RUE DES MOUREZ,0270,58180,58160,Marzy,58,,,58160000BM0020,,,,,,,,,,,,,0,3,Dépendance,,0,S,sols,,,1000,3.074171,46.974366
2023-738767,2023-08-02,000001,Vente,585000,20,,RUE DES MOUREZ,0270,58180,58160,Marzy,58,,,58160000BM0020,,,,,,,,,,,,,0,3,Dépendance,,0,J,jardins,,,1842,3.074171,46.974366
2023-738767,2023-08-02,000001,Vente,585000,,,LES MOUREZ,B141,58180,58160,Marzy,58,,,58160000BM0021,,,,,,,,,,,,,0,,,,,S,sols,,,22,3.074428,46.974663
2023-738770,2023-08-03,000001,Vente,190000,9003,,RTE DE CORCELLES,0107,58180,58160,Marzy,58,,,58160000BO0203,,,,,,,,,,,,,0,1,Maison,99,5,S,sols,,,1077,3.082567,46.98472
2023-738770,2023-08-03,000001,Vente,190000,9003,,RTE DE CORCELLES,0107,58180,58160,Marzy,58,,,58160000BO0203,,,,,,,,,,,,,0,3,Dépendance,,0,S,sols,,,1077,3.082567,46.98472
2023-739012,2023-09-01,000001,Vente,68000,7,,RUE DU MIDI,0250,58180,58160,Marzy,58,,,58160000BK0046,,,,,,,,,,,,,0,1,Maison,34,2,S,sols,,,105,3.088885,46.981059
2023-739012,2023-09-01,000001,Vente,68000,8,,RUE DU MIDI,0250,58180,58160,Marzy,58,,,58160000BK0207,,,,,,,,,,,,,0,,,,,J,jardins,,,20,3.089145,46.981159
2023-739206,2023-09-13,000001,Vente,279958,2,B,RUE DE LA SIMONNERIE,0353,58180,58160,Marzy,58,,,58160000AX0042,,,,,,,,,,,,,0,1,Maison,167,5,J,jardins,,,563,3.092759,46.985163
2023-739206,2023-09-13,000001,Vente,279958,2,B,RUE DE LA SIMONNERIE,0353,58180,58160,Marzy,58,,,58160000AX0042,,,,,,,,,,,,,0,3,Dépendance,,0,J,jardins,,,563,3.092759,46.985163
2023-739206,2023-09-13,000001,Vente,279958,2,B,RUE DE LA SIMONNERIE,0353,58180,58160,Marzy,58,,,58160000AX0042,,,,,,,,,,,,,0,1,Maison,167,5,S,sols,,,645,3.092759,46.985163
2023-739206,2023-09-13,000001,Vente,279958,2,B,RUE DE LA SIMONNERIE,0353,58180,58160,Marzy,58,,,58160000AX0042,,,,,,,,,,,,,0,3,Dépendance,,0,S,sols,,,645,3.092759,46.985163
2023-739401,2023-10-04,000001,Vente,234000,9,B,RUE DU CLOS DES ROCHES,0103,58180,58160,Marzy,58,,,58160000BV0069,,,,,,,,,,,,,0,1,Maison,96,3,S,sols,,,1534,3.081013,46.995814
2023-739401,2023-10-04,000001,Vente,234000,9,B,RUE DU CLOS DES ROCHES,0103,58180,58160,Marzy,58,,,58160000BV0069,,,,,,,,,,,,,0,3,Dépendance,,0,S,sols,,,1534,3.081013,46.995814
2023-739401,2023-10-04,000001,Vente,234000,9,B,RUE DU CLOS DES ROCHES,0103,58180,58160,Marzy,58,,,58160000BV0070,,,,,,,,,,,,,0,,,,,S,sols,,,209,3.080949,46.995242
2023-739559,2023-09-26,000001,Vente,80000,5,,RUE PRINCIPALE,0320,58180,58160,Marzy,58,,,58160000BI0180,,,,,,,,,,,,,0,1,Maison,49,2,S,sols,,,526,3.092296,46.980144
2023-739577,2023-10-13,000001,Vente,195800,60,,AV DUFAUD,0140,58180,58160,Marzy,58,,,58160000AH0041,,,,,,,,,,,,,0,1,Maison,68,3,S,sols,,,500,3.080893,47.009169
2023-739738,2023-10-25,000001,Vente,140000,,,LE VERNAY,B215,58180,58160,Marzy,58,,,581600000C1155,,,,,,,,,,,,,0,,,,,J,jardins,,,4895,3.095374,46.964734
2023-739738,2023-10-25,000001,Vente,140000,279,,CHE DU VERNAY,0375,58180,58160,Marzy,58,,,581600000C1156,,,,,,,,,,,,,0,1,Maison,81,2,S,sols,,,1140,3.09552,46.964375
2023-739738,2023-10-25,000001,Vente,140000,,,LES AUBEPINS,B002,58180,58160,Marzy,58,,,581600000C1310,,,,,,,,,,,,,0,,,,,P,prés,,,767,3.095119,46.964266
2023-739738,2023-10-25,000001,Vente,140000,,,LES AUBEPINS,B002,58180,58160,Marzy,58,,,581600000C1310,,,,,,,,,,,,,0,,,,,P,prés,,,766,3.095119,46.964266
2023-739785,2023-10-30,000001,Vente,173000,9001,,RUE DU MIDI,0250,58180,58160,Marzy,58,,,58160000BK0078,,,,,,,,,,,,,0,1,Maison,114,6,S,sols,,,943,3.08903,46.982244
2023-739843,2023-11-06,000001,Vente,314593.12,9,,RUE DES MESANGES,0243,58180,58160,Marzy,58,,,58160000BO0235,,,,,,,,,,,,,0,1,Maison,127,5,S,sols,,,972,3.086189,46.984323
2023-739843,2023-11-06,000001,Vente,314593.12,9,,RUE DES MESANGES,0243,58180,58160,Marzy,58,,,58160000BO0235,,,,,,,,,,,,,0,3,Dépendance,,0,S,sols,,,972,3.086189,46.984323
2023-740044,2023-11-08,000002,Vente,14000,,,CHAMP DU SAULE,B036,58180,58160,Marzy,58,,,58160000AT0079,,,,,,,,,,,,,0,,,,,T,terres,,,1611,3.117478,46.98926
2023-740302,2023-11-17,000001,Vente,10000,,,PRES DES ROUESSES,B187,58180,58160,Marzy,58,,,58160000AX0023,,,,,,,,,,,,,0,,,,,P,prés,,,7243,3.104026,46.984604
2023-740978,2023-12-22,000001,Vente,134500,21,,AV DU CHASNAY,0085,58180,58160,Marzy,58,,,58160000AL0087,,,,,,,,,,,,,0,1,Maison,70,4,J,jardins,,,1221,3.083098,47.004566
2023-740978,2023-12-22,000001,Vente,134500,21,,AV DU CHASNAY,0085,58180,58160,Marzy,58,,,58160000AL0087,,,,,,,,,,,,,0,1,Maison,70,4,S,sols,,,766,3.083098,47.004566
