id_mutation,date_mutation,numero_disposition,nature_mutation,valeur_fonciere,adresse_numero,adresse_suffixe,adresse_nom_voie,adresse_code_voie,code_postal,code_commune,nom_commune,code_departement,ancien_code_commune,ancien_nom_commune,id_parcelle,ancien_id_parcelle,numero_volume,lot1_numero,lot1_surface_carrez,lot2_numero,lot2_surface_carrez,lot3_numero,lot3_surface_carrez,lot4_numero,lot4_surface_carrez,lot5_numero,lot5_surface_carrez,nombre_lots,code_type_local,type_local,surface_reelle_bati,nombre_pieces_principales,code_nature_culture,nature_culture,code_nature_culture_speciale,nature_culture_speciale,surface_terrain,longitude,latitude
2023-796250,2023-04-17,000001,Vente,350000,36,,LA BUTTE,B007,61250,61261,Le Ménil-Broût,61,,,61261000ZA0058,,,,,,,,,,,,,0,1,Maison,309,9,S,sols,,,1350,0.234509,48.482972
2023-796250,2023-04-17,000001,Vente,350000,36,,LA BUTTE,B007,61250,61261,Le Ménil-Broût,61,,,61261000ZA0058,,,,,,,,,,,,,0,3,Dépendance,,0,S,sols,,,1350,0.234509,48.482972
2023-796250,2023-04-17,000001,Vente,350000,,,LA GASE,B024,61250,61261,Le Ménil-Broût,61,,,61261000ZA0081,,,,,,,,,,,,,0,,,,,P,prés,,,624,0.23413,48.483013
2023-798788,2023-09-08,000001,Vente,90000,9999,,LA PIECE,B053,61250,61261,Le Ménil-Broût,61,,,61261000ZH0086,,,,,,,,,,,,,0,1,Maison,80,3,AG,terrains d'agrément,PARC,Parc,660,0.253722,48.483774
2023-798788,2023-09-08,000001,Vente,90000,9999,,LA PIECE,B053,61250,61261,Le Ménil-Broût,61,,,61261000ZH0086,,,,,,,,,,,,,0,1,Maison,80,3,S,sols,,,500,0.253722,48.483774
2023-800021,2023-11-27,000001,Vente,45000,38,,LA GROUAS,B028,61250,61261,Le Ménil-Broût,61,,,61261000ZA0048,,,,,,,,,,,,,0,1,Maison,80,2,S,sols,,,686,0.23225,48.483414
2023-800021,2023-11-27,000001,Vente,45000,38,,LA GROUAS,B028,61250,61261,Le Ménil-Broût,61,,,61261000ZA0048,,,,,,,,,,,,,0,1,Maison,40,2,J,jardins,POTAG,Jardin potager,686,0.23225,48.483414
2023-800021,2023-11-27,000001,Vente,45000,38,,LA GROUAS,B028,61250,61261,Le Ménil-Broût,61,,,61261000ZA0048,,,,,,,,,,,,,0,1,Maison,80,2,J,jardins,POTAG,Jardin potager,686,0.23225,48.483414
2023-800021,2023-11-27,000001,Vente,45000,38,,LA GROUAS,B028,61250,61261,Le Ménil-Broût,61,,,61261000ZA0048,,,,,,,,,,,,,0,1,Maison,40,2,S,sols,,,686,0.23225,48.483414
2023-800165,2023-11-24,000001,Vente,10,,,LE PETIT PARC,B048,61250,61261,Le Ménil-Broût,61,,,61261000ZE0013,,,,,,,,,,,,,0,,,,,P,prés,,,725,0.230575,48.476908
2023-800879,2023-12-30,000001,Vente,97000,,,L OUCHE,B043,61250,61261,Le Ménil-Broût,61,,,61261000ZD0080,,,,,,,,,,,,,0,,,,,AB,terrains a bâtir,,,1003,0.23061,48.482118
