id_mutation,date_mutation,numero_disposition,nature_mutation,valeur_fonciere,adresse_numero,adresse_suffixe,adresse_nom_voie,adresse_code_voie,code_postal,code_commune,nom_commune,code_departement,ancien_code_commune,ancien_nom_commune,id_parcelle,ancien_id_parcelle,numero_volume,lot1_numero,lot1_surface_carrez,lot2_numero,lot2_surface_carrez,lot3_numero,lot3_surface_carrez,lot4_numero,lot4_surface_carrez,lot5_numero,lot5_surface_carrez,nombre_lots,code_type_local,type_local,surface_reelle_bati,nombre_pieces_principales,code_nature_culture,nature_culture,code_nature_culture_speciale,nature_culture_speciale,surface_terrain,longitude,latitude
2023-796799,2023-05-25,000001,Vente,41500,10,,RUE DE SAINT LAURENT,0001,61290,61274,Les Menus,61,,,61274000ZL0141,,,,,,,,,,,,,0,,,,,J,jardins,POTAG,Jardin potager,884,0.93511,48.522973
2023-796799,2023-05-25,000001,Vente,41500,10,,RUE DE SAINT LAURENT,0001,61290,61274,Les Menus,61,,,61274000ZL0142,,,,,,,,,,,,,0,,,,,S,sols,,,11,0.935397,48.522972
2023-796799,2023-05-25,000001,Vente,41500,10,,RUE DE SAINT LAURENT,0001,61290,61274,Les Menus,61,,,61274000ZL0143,,,,,,,,,,,,,0,,,,,S,sols,,,123,0.935311,48.523011
2023-796799,2023-05-25,000001,Vente,41500,,,RUE DE SAINT LAURENT,0001,61290,61274,Les Menus,61,,,61274000ZL0144,,,,,,,,,,,,,0,,,,,S,sols,,,1,0.935322,48.523079
2023-796995,2023-06-05,000002,Vente,1,36,,LES LOGES,B022,61290,61274,Les Menus,61,,,61274000ZK0187,,,,,,,,,,,,,0,1,Maison,88,4,S,sols,,,55,0.944307,48.506296
2023-797480,2023-06-16,000001,Vente,55000,8,,LA BRULARDIERE,B008,61290,61274,Les Menus,61,,,61274000ZI0049,,,,,,,,,,,,,0,,,,,S,sols,,,1343,0.953955,48.50908
2023-797480,2023-06-16,000001,Vente,55000,,,LA BRULARDIERE,B008,61290,61274,Les Menus,61,,,61274000ZI0051,,,,,,,,,,,,,0,,,,,P,prés,,,305,0.953788,48.508861
2023-799532,2023-10-16,000001,Vente,270000,,,LES LOGES,B022,61290,61274,Les Menus,61,,,61274000ZK0079,,,,,,,,,,,,,0,,,,,J,jardins,POTAG,Jardin potager,885,0.948376,48.505099
2023-799532,2023-10-16,000001,Vente,270000,13,,LES LOGES,B022,61290,61274,Les Menus,61,,,61274000ZK0117,,,,,,,,,,,,,0,3,Dépendance,,0,S,sols,,,1273,0.948197,48.505571
2023-799532,2023-10-16,000001,Vente,270000,13,,LES LOGES,B022,61290,61274,Les Menus,61,,,61274000ZK0117,,,,,,,,,,,,,0,1,Maison,183,4,S,sols,,,1273,0.948197,48.505571
2023-799532,2023-10-16,000001,Vente,270000,13,,LES LOGES,B022,61290,61274,Les Menus,61,,,61274000ZK0117,,,,,,,,,,,,,0,3,Dépendance,,0,S,sols,,,1273,0.948197,48.505571
2023-799532,2023-10-16,000001,Vente,270000,,,LES LOGES,B022,61290,61274,Les Menus,61,,,61274000ZK0129,,,,,,,,,,,,,0,,,,,P,prés,,,362,0.947648,48.504325
2023-799532,2023-10-16,000001,Vente,270000,,,LES LOGES,B022,61290,61274,Les Menus,61,,,61274000ZK0132,,,,,,,,,,,,,0,,,,,P,prés,,,7930,0.94792,48.504527
2023-800120,2023-11-25,000001,Vente,115850,,,LES CHAMPS CORONS,B009,61290,61274,Les Menus,61,,,61274000ZB0089,,,,,,,,,,,,,0,,,,,T,terres,,,6500,0.898981,48.519565
2023-800120,2023-11-25,000001,Vente,115850,,,LES CHAMPS CORONS,B009,61290,61274,Les Menus,61,,,61274000ZB0090,,,,,,,,,,,,,0,,,,,P,prés,,,12210,0.898196,48.519447
2023-800120,2023-11-25,000001,Vente,115850,,,LA BONDE,B005,61290,61274,Les Menus,61,,,61274000ZK0037,,,,,,,,,,,,,0,,,,,P,prés,,,2010,0.930571,48.50311
2023-800120,2023-11-25,000001,Vente,115850,,,LA BONDE,B005,61290,61274,Les Menus,61,,,61274000ZK0112,,,,,,,,,,,,,0,,,,,P,prés,,,3920,0.931354,48.503349
2023-800120,2023-11-25,000001,Vente,115850,,,LA BONDE,B005,61290,61274,Les Menus,61,,,61274000ZK0113,,,,,,,,,,,,,0,,,,,P,prés,,,7200,0.932062,48.503582
2023-800140,2023-11-23,000001,Vente,27975.6,,,LES CHAMPS CORONS,B009,61290,61274,Les Menus,61,,,61274000ZB0078,,,,,,,,,,,,,0,,,,,T,terres,,,26584,0.903804,48.516386
