id_mutation,date_mutation,numero_disposition,nature_mutation,valeur_fonciere,adresse_numero,adresse_suffixe,adresse_nom_voie,adresse_code_voie,code_postal,code_commune,nom_commune,code_departement,ancien_code_commune,ancien_nom_commune,id_parcelle,ancien_id_parcelle,numero_volume,lot1_numero,lot1_surface_carrez,lot2_numero,lot2_surface_carrez,lot3_numero,lot3_surface_carrez,lot4_numero,lot4_surface_carrez,lot5_numero,lot5_surface_carrez,nombre_lots,code_type_local,type_local,surface_reelle_bati,nombre_pieces_principales,code_nature_culture,nature_culture,code_nature_culture_speciale,nature_culture_speciale,surface_terrain,longitude,latitude
2023-797664,2023-06-23,000001,Vente,5000,349,,RTE DU BOSC RENOULT,0010,61120,61333,Pontchardon,61,,,613330000A0109,,,,,,,,,,,,,0,1,Maison,80,4,S,sols,,,150,0.270457,48.929726
2023-797679,2023-06-23,000001,Vente,40000,343,,RTE DU BOSC RENOULT,0010,61120,61333,Pontchardon,61,,,613330000A0293,,,,,,,,,,,,,0,3,Dépendance,,0,P,prés,,,646,0.270383,48.929771
2023-797679,2023-06-23,000001,Vente,40000,343,,RTE DU BOSC RENOULT,0010,61120,61333,Pontchardon,61,,,613330000A0293,,,,,,,,,,,,,0,1,Maison,70,6,P,prés,,,646,0.270383,48.929771
2023-797679,2023-06-23,000001,Vente,40000,,,LA COUR,B037,61120,61333,Pontchardon,61,,,613330000A0296,,,,,,,,,,,,,0,,,,,S,sols,,,264,0.26991,48.929754
2023-797679,2023-06-23,000001,Vente,40000,,,LA COUR,B037,61120,61333,Pontchardon,61,,,613330000A0308,,,,,,,,,,,,,0,,,,,P,prés,,,774,0.270298,48.930129
2023-798205,2023-07-29,000001,Vente,68000,,,LE BOURG,B017,61120,61333,Pontchardon,61,,,613330000A0162,,,,,,,,,,,,,0,,,,,S,sols,,,5,0.265316,48.929027
2023-798205,2023-07-29,000001,Vente,68000,,,LE BOURG,B017,61120,61333,Pontchardon,61,,,613330000A0163,,,,,,,,,,,,,0,,,,,P,prés,,,1689,0.265347,48.929124
2023-798205,2023-07-29,000001,Vente,68000,91,,RTE DE CANAPVILLE,0001,61120,61333,Pontchardon,61,,,613330000A0304,,,,,,,,,,,,,0,1,Maison,34,2,S,sols,,,357,0.265811,48.929127
2023-798205,2023-07-29,000001,Vente,68000,91,,RTE DE CANAPVILLE,0001,61120,61333,Pontchardon,61,,,613330000A0304,,,,,,,,,,,,,0,3,Dépendance,,0,S,sols,,,357,0.265811,48.929127
