id_mutation,date_mutation,numero_disposition,nature_mutation,valeur_fonciere,adresse_numero,adresse_suffixe,adresse_nom_voie,adresse_code_voie,code_postal,code_commune,nom_commune,code_departement,ancien_code_commune,ancien_nom_commune,id_parcelle,ancien_id_parcelle,numero_volume,lot1_numero,lot1_surface_carrez,lot2_numero,lot2_surface_carrez,lot3_numero,lot3_surface_carrez,lot4_numero,lot4_surface_carrez,lot5_numero,lot5_surface_carrez,nombre_lots,code_type_local,type_local,surface_reelle_bati,nombre_pieces_principales,code_nature_culture,nature_culture,code_nature_culture_speciale,nature_culture_speciale,surface_terrain,longitude,latitude
2023-801358,2023-01-20,000001,Vente,83000,124,,RUE JULES LEFEBVRE,0070,62760,62030,Amplier,62,,,620300000A0040,,,,,,,,,,,,,0,1,Maison,140,4,S,sols,,,250,2.398672,50.137833
2023-801358,2023-01-20,000001,Vente,83000,124,,RUE JULES LEFEBVRE,0070,62760,62030,Amplier,62,,,620300000A0040,,,,,,,,,,,,,0,3,Dépendance,,0,S,sols,,,250,2.398672,50.137833
2023-801358,2023-01-20,000001,Vente,83000,124,,RUE JULES LEFEBVRE,0070,62760,62030,Amplier,62,,,620300000A0040,,,,,,,,,,,,,0,3,Dépendance,,0,S,sols,,,250,2.398672,50.137833
2023-801358,2023-01-20,000001,Vente,83000,,,LE VILLAGE,B067,62760,62030,Amplier,62,,,620300000A1091,,,,,,,,,,,,,0,,,,,S,sols,,,187,2.398774,50.137942
2023-801358,2023-01-20,000001,Vente,83000,,,LE VILLAGE,B067,62760,62030,Amplier,62,,,620300000A1093,,,,,,,,,,,,,0,,,,,S,sols,,,184,2.398931,50.138032
2023-801550,2023-02-16,000001,Vente,2800,,,LE JAMBON,B040,62760,62030,Amplier,62,,,620300000A0381,,,,,,,,,,,,,0,,,,,T,terres,,,1880,2.404902,50.143641
2023-801550,2023-02-16,000001,Vente,2800,,,LA PIERRE,B049,62760,62030,Amplier,62,,,620300000A0464,,,,,,,,,,,,,0,,,,,T,terres,,,2380,2.404203,50.143178
2023-802571,2023-05-10,000001,Vente,24280,,,LES CHAMPS REINE,B015,62760,62030,Amplier,62,,,62030000ZA0061,,,,,,,,,,,,,0,,,,,T,terres,,,8860,2.387383,50.121083
2023-802571,2023-05-10,000001,Vente,24280,,,LES CHAMPS REINE,B015,62760,62030,Amplier,62,,,62030000ZA0061,,,,,,,,,,,,,0,,,,,T,terres,,,7710,2.387383,50.121083
2023-802571,2023-05-10,000001,Vente,24280,,,LES CHAMPS REINE,B015,62760,62030,Amplier,62,,,62030000ZA0061,,,,,,,,,,,,,0,,,,,T,terres,,,7710,2.387383,50.121083
2023-802599,2023-05-16,000001,Vente,1200,,,LA VALLEE,B064,62760,62030,Amplier,62,,,620300000B0810,,,,,,,,,,,,,0,,,,,T,terres,,,1940,2.388832,50.126995
2023-803186,2023-06-23,000001,Vente,290000,,,LE VILLAGE,B067,62760,62030,Amplier,62,,,620300000A0023,,,,,,,,,,,,,0,,,,,J,jardins,,,1785,2.396379,50.139422
2023-803186,2023-06-23,000001,Vente,290000,338,,RUE JULES LEFEBVRE,0070,62760,62030,Amplier,62,,,620300000A1294,,,,,,,,,,,,,0,3,Dépendance,,0,S,sols,,,1316,2.39618,50.139029
2023-803186,2023-06-23,000001,Vente,290000,338,,RUE JULES LEFEBVRE,0070,62760,62030,Amplier,62,,,620300000A1294,,,,,,,,,,,,,0,1,Maison,220,8,S,sols,,,1316,2.39618,50.139029
2023-804066,2023-08-24,000001,Vente,942,,,LE DERRIERE DES HAYES,B022,62760,62030,Amplier,62,,,620300000A0446,,,,,,,,,,,,,0,,,,,P,prés,,,1570,2.400341,50.14058
2023-805865,2023-12-15,000001,Vente,60000,17,,RUE D ALBERT,0020,62760,62030,Amplier,62,,,620300000B0860,,,,,,,,,,,,,0,1,Maison,115,3,S,sols,,,830,2.395561,50.134231
2023-805865,2023-12-15,000001,Vente,60000,17,,RUE D ALBERT,0020,62760,62030,Amplier,62,,,620300000B0860,,,,,,,,,,,,,0,3,Dépendance,,0,S,sols,,,830,2.395561,50.134231
