id_mutation,date_mutation,numero_disposition,nature_mutation,valeur_fonciere,adresse_numero,adresse_suffixe,adresse_nom_voie,adresse_code_voie,code_postal,code_commune,nom_commune,code_departement,ancien_code_commune,ancien_nom_commune,id_parcelle,ancien_id_parcelle,numero_volume,lot1_numero,lot1_surface_carrez,lot2_numero,lot2_surface_carrez,lot3_numero,lot3_surface_carrez,lot4_numero,lot4_surface_carrez,lot5_numero,lot5_surface_carrez,nombre_lots,code_type_local,type_local,surface_reelle_bati,nombre_pieces_principales,code_nature_culture,nature_culture,code_nature_culture_speciale,nature_culture_speciale,surface_terrain,longitude,latitude
2023-814743,2023-02-17,000001,Vente,149000,2736,,RUE PRINCIPALE,0125,62185,62360,Fréthun,62,,,62360000AC0003,,,,,,,,,,,,,0,1,Maison,176,6,S,sols,,,604,1.810095,50.908405
2023-815078,2023-02-01,000001,Vente,5500,,,RUE DES PRAIRIES,0120,62185,62360,Fréthun,62,,,62360000AD0083,,,,,,,,,,,,,0,,,,,P,prés,,,5432,1.82976,50.916936
2023-815078,2023-02-01,000001,Vente,5500,,,LE VILLAGE,B029,62185,62360,Fréthun,62,,,62360000AD0084,,,,,,,,,,,,,0,,,,,P,prés,,,114,1.829443,50.91731
2023-815078,2023-02-01,000001,Vente,5500,,,LE VILLAGE,B029,62185,62360,Fréthun,62,,,62360000AD0085,,,,,,,,,,,,,0,,,,,P,prés,,,621,1.829401,50.917401
2023-815619,2023-03-17,000001,Vente,134500,4,,RESIDENCE DES PRAIRIES,0122,62185,62360,Fréthun,62,,,62360000AD0141,,,,,,,,,,,,,0,1,Maison,70,2,S,sols,,,159,1.827551,50.915028
2023-816607,2023-04-21,000001,Vente,1,,,RUE PRINCIPALE,0125,62185,62360,Fréthun,62,,,62360000AC0217,,,,,,,,,,,,,0,,,,,T,terres,,,2265,1.812466,50.909557
2023-817369,2023-05-12,000001,Vente,201700,1361,,RUE PRINCIPALE,0125,62185,62360,Fréthun,62,,,62360000AD0224,,,,,,,,,,,,,0,,,,,S,sols,,,43,1.822911,50.916117
2023-817369,2023-05-12,000001,Vente,201700,1361,,RUE PRINCIPALE,0125,62185,62360,Fréthun,62,,,62360000AD0225,,,,,,,,,,,,,0,,,,,S,sols,,,107,1.823005,50.916006
2023-817369,2023-05-12,000001,Vente,201700,1361,,RUE PRINCIPALE,0125,62185,62360,Fréthun,62,,,62360000AD0226,,,,,,,,,,,,,0,1,Maison,128,5,S,sols,,,336,1.822919,50.915984
2023-817369,2023-05-12,000001,Vente,201700,1361,,RUE PRINCIPALE,0125,62185,62360,Fréthun,62,,,62360000AD0226,,,,,,,,,,,,,0,3,Dépendance,,0,S,sols,,,336,1.822919,50.915984
2023-817870,2023-06-16,000001,Vente,256000,1014,,RUE PRINCIPALE,0125,62185,62360,Fréthun,62,,,62360000AE0108,,,,,,,,,,,,,0,1,Maison,112,5,S,sols,,,544,1.825399,50.918319
2023-819682,2023-08-04,000001,Vente,265000,6,,RUE DOMAINE DU MOULIN,0081,62185,62360,Fréthun,62,,,62360000AC0149,,,,,,,,,,,,,0,1,Maison,138,6,S,sols,,,102,1.816935,50.910269
2023-819682,2023-08-04,000001,Vente,265000,,,RUE PARENTY,0110,62185,62360,Fréthun,62,,,62360000AC0150,,,,,,,,,,,,,0,,,,,S,sols,,,245,1.816692,50.910463
2023-819682,2023-08-04,000001,Vente,265000,115,,RUE PARENTY,0110,62185,62360,Fréthun,62,,,62360000AC0159,,,,,,,,,,,,,0,,,,,S,sols,,,378,1.81683,50.910381
2023-820927,2023-09-28,000001,Vente,6000,,,LE MARAIS DE COULOGNE,B019,62185,62360,Fréthun,62,,,623600000B0597,,,,,,,,,,,,,0,,,,,P,prés,,,11960,1.856393,50.915538
2023-820979,2023-09-12,000001,Vente,125000,4,,RUE LOUIS LEDUC,0073,62185,62360,Fréthun,62,,,62360000AB0015,,,,,,,,,,,,,0,1,Maison,73,4,S,sols,,,379,1.811226,50.906181
2023-821731,2023-10-20,000001,Vente,570000,50,,RUE PRINCIPALE,0125,62185,62360,Fréthun,62,,,62360000AH0102,,,,,,,,,,,,,0,4,Local industriel. commercial ou assimilé,3708,0,S,sols,,,3708,1.835018,50.923776
2023-821814,2023-10-30,000001,Vente,199536,25,,RESIDENCE DES PRAIRIES,0122,62185,62360,Fréthun,62,,,62360000AD0117,,,,,,,,,,,,,0,1,Maison,112,6,S,sols,,,264,1.828866,50.914877
2023-823206,2023-12-04,000001,Vente,75000,68,,RUE DE LA GARE,0045,62185,62360,Fréthun,62,,,62360000AB0031,,,,,,,,,,,,,0,3,Dépendance,,0,S,sols,,,343,1.811455,50.905296
2023-823206,2023-12-04,000001,Vente,75000,68,,RUE DE LA GARE,0045,62185,62360,Fréthun,62,,,62360000AB0031,,,,,,,,,,,,,0,3,Dépendance,,0,J,jardins,,,995,1.811455,50.905296
2023-823206,2023-12-04,000001,Vente,75000,68,,RUE DE LA GARE,0045,62185,62360,Fréthun,62,,,62360000AB0031,,,,,,,,,,,,,0,3,Dépendance,,0,J,jardins,,,995,1.811455,50.905296
2023-823206,2023-12-04,000001,Vente,75000,68,,RUE DE LA GARE,0045,62185,62360,Fréthun,62,,,62360000AB0031,,,,,,,,,,,,,0,1,Maison,72,4,J,jardins,,,995,1.811455,50.905296
2023-823206,2023-12-04,000001,Vente,75000,68,,RUE DE LA GARE,0045,62185,62360,Fréthun,62,,,62360000AB0031,,,,,,,,,,,,,0,3,Dépendance,,0,S,sols,,,343,1.811455,50.905296
2023-823206,2023-12-04,000001,Vente,75000,68,,RUE DE LA GARE,0045,62185,62360,Fréthun,62,,,62360000AB0031,,,,,,,,,,,,,0,1,Maison,72,4,S,sols,,,343,1.811455,50.905296
2023-824017,2023-12-20,000001,Vente,5000,,,LE MARAIS DE FRETHUN,B020,62185,62360,Fréthun,62,,,623600000B0637,,,,,,,,,,,,,0,,,,,P,prés,,,4440,1.845232,50.915806
