id_mutation,date_mutation,numero_disposition,nature_mutation,valeur_fonciere,adresse_numero,adresse_suffixe,adresse_nom_voie,adresse_code_voie,code_postal,code_commune,nom_commune,code_departement,ancien_code_commune,ancien_nom_commune,id_parcelle,ancien_id_parcelle,numero_volume,lot1_numero,lot1_surface_carrez,lot2_numero,lot2_surface_carrez,lot3_numero,lot3_surface_carrez,lot4_numero,lot4_surface_carrez,lot5_numero,lot5_surface_carrez,nombre_lots,code_type_local,type_local,surface_reelle_bati,nombre_pieces_principales,code_nature_culture,nature_culture,code_nature_culture_speciale,nature_culture_speciale,surface_terrain,longitude,latitude
2023-801501,2023-02-24,000001,Vente,159500,13,,RUE NEUVE,0260,62690,62363,Frévin-Capelle,62,,,623630000B0708,,,,,,,,,,,,,0,1,Maison,98,4,S,sols,,,1047,2.630342,50.352811
2023-801862,2023-03-16,000001,Vente,236100,1,,RUE DU VENT DE BISE,0320,62690,62363,Frévin-Capelle,62,,,623630000B0519,,,,,,,,,,,,,0,1,Maison,116,6,S,sols,,,517,2.640303,50.350279
2023-801862,2023-03-16,000001,Vente,236100,,,LE VILLAGE,B045,62690,62363,Frévin-Capelle,62,,,623630000B0520,,,,,,,,,,,,,0,,,,,S,sols,,,23,2.640208,50.350215
2023-801862,2023-03-16,000001,Vente,236100,,,LE VILLAGE,B045,62690,62363,Frévin-Capelle,62,,,623630000B0676,,,,,,,,,,,,,0,,,,,S,sols,,,226,2.640375,50.35024
2023-802829,2023-05-31,000001,Vente,185000,9,,RUE DU GENERAL DE GAULLE,0150,62690,62363,Frévin-Capelle,62,,,623630000B0718,,,,,,,,,,,,,0,1,Maison,153,4,S,sols,,,297,2.635099,50.351123
2023-803468,2023-07-07,000001,Vente,458000,31,,RUE DU GENERAL DE GAULLE,0150,62690,62363,Frévin-Capelle,62,,,623630000B0830,,,,,,,,,,,,,0,1,Maison,173,7,S,sols,,,920,2.630543,50.350512
2023-803468,2023-07-07,000001,Vente,458000,31,,RUE DU GENERAL DE GAULLE,0150,62690,62363,Frévin-Capelle,62,,,623630000B0830,,,,,,,,,,,,,0,3,Dépendance,,0,S,sols,,,920,2.630543,50.350512
2023-803790,2023-07-27,000001,Vente,142500,6,B,RUE DU MARECHAL LECLERC,0160,62690,62363,Frévin-Capelle,62,,,623630000B0848,,,,,,,,,,,,,0,1,Maison,55,2,S,sols,,,414,2.636499,50.349406
2023-804408,2023-09-14,000001,Vente,121500,4,,RUE ALFRED DEVILLERS,0020,62690,62363,Frévin-Capelle,62,,,623630000B0727,,,,,,,,,,,,,0,1,Maison,147,5,S,sols,,,472,2.629892,50.348828
2023-804408,2023-09-14,000001,Vente,121500,4,,RUE ALFRED DEVILLERS,0020,62690,62363,Frévin-Capelle,62,,,623630000B0727,,,,,,,,,,,,,0,3,Dépendance,,0,J,jardins,,,546,2.629892,50.348828
2023-804408,2023-09-14,000001,Vente,121500,4,,RUE ALFRED DEVILLERS,0020,62690,62363,Frévin-Capelle,62,,,623630000B0727,,,,,,,,,,,,,0,1,Maison,147,5,J,jardins,,,546,2.629892,50.348828
2023-804408,2023-09-14,000001,Vente,121500,4,,RUE ALFRED DEVILLERS,0020,62690,62363,Frévin-Capelle,62,,,623630000B0727,,,,,,,,,,,,,0,3,Dépendance,,0,S,sols,,,472,2.629892,50.348828
