id_mutation,date_mutation,numero_disposition,nature_mutation,valeur_fonciere,adresse_numero,adresse_suffixe,adresse_nom_voie,adresse_code_voie,code_postal,code_commune,nom_commune,code_departement,ancien_code_commune,ancien_nom_commune,id_parcelle,ancien_id_parcelle,numero_volume,lot1_numero,lot1_surface_carrez,lot2_numero,lot2_surface_carrez,lot3_numero,lot3_surface_carrez,lot4_numero,lot4_surface_carrez,lot5_numero,lot5_surface_carrez,nombre_lots,code_type_local,type_local,surface_reelle_bati,nombre_pieces_principales,code_nature_culture,nature_culture,code_nature_culture_speciale,nature_culture_speciale,surface_terrain,longitude,latitude
2023-801637,2023-03-02,000001,Vente,110000,16,,GR GRAND RUE,0040,62270,62631,Nuncq-Hautecôte,62,,,626310000A0325,,,,,,,,,,,,,0,3,Dépendance,,0,S,sols,,,472,2.28581,50.306271
2023-801637,2023-03-02,000001,Vente,110000,16,,GR GRAND RUE,0040,62270,62631,Nuncq-Hautecôte,62,,,626310000A0325,,,,,,,,,,,,,0,1,Maison,135,6,S,sols,,,472,2.28581,50.306271
2023-801637,2023-03-02,000001,Vente,110000,16,,GR GRAND RUE,0040,62270,62631,Nuncq-Hautecôte,62,,,626310000A0325,,,,,,,,,,,,,0,3,Dépendance,,0,S,sols,,,472,2.28581,50.306271
2023-801637,2023-03-02,000001,Vente,110000,16,,GR GRAND RUE,0040,62270,62631,Nuncq-Hautecôte,62,,,626310000A0325,,,,,,,,,,,,,0,3,Dépendance,,0,S,sols,,,472,2.28581,50.306271
2023-801867,2023-03-15,000001,Vente,50000,,,LE VILLAGE,B030,62270,62631,Nuncq-Hautecôte,62,,,626310000A0831,,,,,,,,,,,,,0,,,,,AB,terrains a bâtir,,,1704,2.293515,50.306496
2023-802189,2023-03-31,000001,Vente,7000,,,LE CHEMIN DE BUNEVILLE,B046,62270,62631,Nuncq-Hautecôte,62,,,62631000ZE0047,,,,,,,,,,,,,0,,,,,P,prés,,,590,2.297079,50.308751
2023-802189,2023-03-31,000001,Vente,7000,,,LE CHEMIN DE BUNEVILLE,B046,62270,62631,Nuncq-Hautecôte,62,,,62631000ZE0047,,,,,,,,,,,,,0,,,,,T,terres,,,2246,2.297079,50.308751
2023-802189,2023-03-31,000001,Vente,7000,,,LE CHEMIN DE BUNEVILLE,B046,62270,62631,Nuncq-Hautecôte,62,,,62631000ZE0047,,,,,,,,,,,,,0,,,,,T,terres,,,2246,2.297079,50.308751
2023-802522,2023-05-05,000001,Vente,148000,9,,RUE DE BOUBERS,0005,62270,62631,Nuncq-Hautecôte,62,,,626310000C0076,,,,,,,,,,,,,0,1,Maison,102,5,J,jardins,,,480,2.272617,50.30397
2023-802522,2023-05-05,000001,Vente,148000,,,LE VILLAGE,B030,62270,62631,Nuncq-Hautecôte,62,,,626310000C0077,,,,,,,,,,,,,0,,,,,S,sols,,,590,,
2023-802522,2023-05-05,000001,Vente,148000,,,LE VILLAGE,B030,62270,62631,Nuncq-Hautecôte,62,,,626310000C0367,,,,,,,,,,,,,0,,,,,S,sols,,,325,,
2023-802522,2023-05-05,000001,Vente,148000,,,LE VILLAGE,B030,62270,62631,Nuncq-Hautecôte,62,,,626310000C0367,,,,,,,,,,,,,0,,,,,P,prés,,,523,,
2023-802775,2023-05-23,000001,Vente,105000,,,LE VILLAGE,B030,62270,62631,Nuncq-Hautecôte,62,,,626310000A0619,,,,,,,,,,,,,0,,,,,J,jardins,,,133,2.286783,50.304274
2023-802775,2023-05-23,000001,Vente,105000,1,,RUE NEUVE,0084,62270,62631,Nuncq-Hautecôte,62,,,626310000A0621,,,,,,,,,,,,,0,3,Dépendance,,0,J,jardins,,,431,2.286825,50.304195
2023-802775,2023-05-23,000001,Vente,105000,1,,RUE NEUVE,0084,62270,62631,Nuncq-Hautecôte,62,,,626310000A0621,,,,,,,,,,,,,0,1,Maison,63,3,J,jardins,,,431,2.286825,50.304195
2023-802775,2023-05-23,000001,Vente,105000,1,,RUE NEUVE,0084,62270,62631,Nuncq-Hautecôte,62,,,626310000A0621,,,,,,,,,,,,,0,1,Maison,63,3,S,sols,,,436,2.286825,50.304195
2023-802775,2023-05-23,000001,Vente,105000,1,,RUE NEUVE,0084,62270,62631,Nuncq-Hautecôte,62,,,626310000A0621,,,,,,,,,,,,,0,3,Dépendance,,0,S,sols,,,436,2.286825,50.304195
2023-804136,2023-08-21,000001,Vente,170000,2,,RUE NEUVE,0084,62270,62631,Nuncq-Hautecôte,62,,,626310000A0476,,,,,,,,,,,,,0,1,Maison,69,3,S,sols,,,470,2.288444,50.304112
2023-804136,2023-08-21,000001,Vente,170000,2,,RUE NEUVE,0084,62270,62631,Nuncq-Hautecôte,62,,,626310000A0476,,,,,,,,,,,,,0,3,Dépendance,,0,S,sols,,,470,2.288444,50.304112
2023-804136,2023-08-21,000001,Vente,170000,2,,RUE NEUVE,0084,62270,62631,Nuncq-Hautecôte,62,,,626310000A0476,,,,,,,,,,,,,0,3,Dépendance,,0,S,sols,,,470,2.288444,50.304112
2023-804136,2023-08-21,000001,Vente,170000,,,LE VILLAGE,B030,62270,62631,Nuncq-Hautecôte,62,,,626310000A0477,,,,,,,,,,,,,0,,,,,J,jardins,,,353,2.288632,50.304075
2023-804136,2023-08-21,000001,Vente,170000,,,LE VILLAGE,B030,62270,62631,Nuncq-Hautecôte,62,,,626310000A0478,,,,,,,,,,,,,0,,,,,P,prés,,,845,2.288392,50.303925
2023-804279,2023-09-04,000001,Vente,127820,7,,RES LES ALOUETTES,0002,62270,62631,Nuncq-Hautecôte,62,,,62631000ZD0068,,,,,,,,,,,,,0,1,Maison,91,4,S,sols,,,500,2.294395,50.308608
2023-804279,2023-09-04,000001,Vente,127820,7,,RES LES ALOUETTES,0002,62270,62631,Nuncq-Hautecôte,62,,,62631000ZD0068,,,,,,,,,,,,,0,1,Maison,91,4,J,jardins,,,664,2.294395,50.308608
2023-804612,2023-09-29,000002,Vente,7000,,,LE VILLAGE,B030,62270,62631,Nuncq-Hautecôte,62,,,626310000C0466,,,,,,,,,,,,,0,,,,,S,sols,,,319,2.272514,50.303735
2023-805015,2023-10-18,000002,Vente,36000,,,LE VILLAGE,B030,62270,62631,Nuncq-Hautecôte,62,,,626310000C0464,,,,,,,,,,,,,0,,,,,P,prés,,,1095,,
2023-805216,2023-11-09,000001,Vente,46431,,,LA PLAINE D ECOIVRES,B016,62270,62631,Nuncq-Hautecôte,62,,,62631000ZD0028,,,,,,,,,,,,,0,,,,,T,terres,,,51590,2.290581,50.31238
2023-805389,2023-11-10,000001,Vente,8000,,,LE VILLAGE,B030,62270,62631,Nuncq-Hautecôte,62,,,626310000A0758,,,,,,,,,,,,,0,,,,,T,terres,,,3543,2.289052,50.302634
2023-805389,2023-11-10,000001,Vente,8000,,,LE VILLAGE,B030,62270,62631,Nuncq-Hautecôte,62,,,626310000A0758,,,,,,,,,,,,,0,,,,,S,sols,,,755,2.289052,50.302634
2023-805389,2023-11-10,000001,Vente,8000,,,LE VILLAGE,B030,62270,62631,Nuncq-Hautecôte,62,,,626310000A0761,,,,,,,,,,,,,0,,,,,P,prés,,,371,2.28941,50.3029
