id_mutation,date_mutation,numero_disposition,nature_mutation,valeur_fonciere,adresse_numero,adresse_suffixe,adresse_nom_voie,adresse_code_voie,code_postal,code_commune,nom_commune,code_departement,ancien_code_commune,ancien_nom_commune,id_parcelle,ancien_id_parcelle,numero_volume,lot1_numero,lot1_surface_carrez,lot2_numero,lot2_surface_carrez,lot3_numero,lot3_surface_carrez,lot4_numero,lot4_surface_carrez,lot5_numero,lot5_surface_carrez,nombre_lots,code_type_local,type_local,surface_reelle_bati,nombre_pieces_principales,code_nature_culture,nature_culture,code_nature_culture_speciale,nature_culture_speciale,surface_terrain,longitude,latitude
2023-813713,2023-01-06,000001,Vente,3000,,,LE FOND DE SAINS,B013,62990,62725,Royon,62,,,62725000ZD0031,,,,,,,,,,,,,0,,,,,T,terres,,,4480,2.022312,50.467657
2023-813713,2023-01-06,000001,Vente,3000,,,LE FOND DE SAINS,B013,62990,62725,Royon,62,,,62725000ZD0032,,,,,,,,,,,,,0,,,,,T,terres,,,60,2.022066,50.467389
2023-815743,2023-03-29,000001,Vente,158000,,,LE VILLAGE,B034,62990,62725,Royon,62,,,62725000AD0002,,,,,,,,,,,,,0,,,,,T,terres,,,1235,1.993731,50.470483
2023-815743,2023-03-29,000001,Vente,158000,11,,RUE BLANCHE,0029,62990,62725,Royon,62,,,62725000AD0003,,,,,,,,,,,,,0,1,Maison,79,3,S,sols,,,1000,1.993724,50.470908
2023-815743,2023-03-29,000001,Vente,158000,11,,RUE BLANCHE,0029,62990,62725,Royon,62,,,62725000AD0003,,,,,,,,,,,,,0,1,Maison,79,3,J,jardins,,,1383,1.993724,50.470908
2023-818349,2023-06-17,000001,Vente,175000,8,,RUE PRINCIPALE,0131,62990,62725,Royon,62,,,62725000AD0010,,,,,,,,,,,,,0,1,Maison,100,5,J,jardins,,,1621,1.994993,50.472275
2023-818349,2023-06-17,000001,Vente,175000,8,,RUE PRINCIPALE,0131,62990,62725,Royon,62,,,62725000AD0010,,,,,,,,,,,,,0,3,Dépendance,,0,J,jardins,,,1621,1.994993,50.472275
2023-818349,2023-06-17,000001,Vente,175000,8,,RUE PRINCIPALE,0131,62990,62725,Royon,62,,,62725000AD0010,,,,,,,,,,,,,0,1,Maison,100,5,S,sols,,,337,1.994993,50.472275
2023-818349,2023-06-17,000001,Vente,175000,8,,RUE PRINCIPALE,0131,62990,62725,Royon,62,,,62725000AD0010,,,,,,,,,,,,,0,3,Dépendance,,0,S,sols,,,337,1.994993,50.472275
