id_mutation,date_mutation,numero_disposition,nature_mutation,valeur_fonciere,adresse_numero,adresse_suffixe,adresse_nom_voie,adresse_code_voie,code_postal,code_commune,nom_commune,code_departement,ancien_code_commune,ancien_nom_commune,id_parcelle,ancien_id_parcelle,numero_volume,lot1_numero,lot1_surface_carrez,lot2_numero,lot2_surface_carrez,lot3_numero,lot3_surface_carrez,lot4_numero,lot4_surface_carrez,lot5_numero,lot5_surface_carrez,nombre_lots,code_type_local,type_local,surface_reelle_bati,nombre_pieces_principales,code_nature_culture,nature_culture,code_nature_culture_speciale,nature_culture_speciale,surface_terrain,longitude,latitude
2023-857412,2023-06-07,000001,Vente,1800,,,ARTIGUEBERE,B002,65130,65037,Artiguemy,65,,,650370000A0197,,,,,,,,,,,,,0,,,,,P,prés,,,4666,0.260501,43.126381
2023-857916,2023-06-22,000001,Vente,15000,,,BARD,B004,65130,65037,Artiguemy,65,,,650370000A0227,,,,,,,,,,,,,0,,,,,L,landes,PATUR,Pâture plantée,450,0.255727,43.122804
2023-857916,2023-06-22,000001,Vente,15000,,,BARD,B004,65130,65037,Artiguemy,65,,,650370000A0228,,,,,,,,,,,,,0,,,,,P,prés,,,4030,0.256314,43.122784
2023-857916,2023-06-22,000001,Vente,15000,,,LATRINGUE,B016,65130,65037,Artiguemy,65,,,650370000A0235,,,,,,,,,,,,,0,,,,,L,landes,PATUR,Pâture plantée,3546,0.256344,43.124032
2023-857916,2023-06-22,000001,Vente,15000,,,LATRINGUE,B016,65130,65037,Artiguemy,65,,,650370000A0273,,,,,,,,,,,,,0,,,,,L,landes,PATUR,Pâture plantée,2745,0.251516,43.125133
2023-857916,2023-06-22,000001,Vente,15000,,,AOULERE,B018,65130,65037,Artiguemy,65,,,650370000A0280,,,,,,,,,,,,,0,,,,,L,landes,FRICH,Friche,1800,0.25301,43.125702
2023-857916,2023-06-22,000001,Vente,15000,,,AOULERE,B018,65130,65037,Artiguemy,65,,,650370000A0285,,,,,,,,,,,,,0,,,,,L,landes,FRICH,Friche,2574,0.253562,43.126044
2023-857916,2023-06-22,000001,Vente,15000,,,AOULERE,B018,65130,65037,Artiguemy,65,,,650370000A0286,,,,,,,,,,,,,0,,,,,VI,vignes,,,3774,0.254089,43.126365
2023-857916,2023-06-22,000001,Vente,15000,,,AOULERE,B018,65130,65037,Artiguemy,65,,,650370000A0287,,,,,,,,,,,,,0,,,,,L,landes,FRICH,Friche,2569,0.253083,43.126663
2023-857916,2023-06-22,000001,Vente,15000,,,AOULERE,B018,65130,65037,Artiguemy,65,,,650370000A0288,,,,,,,,,,,,,0,,,,,VI,vignes,,,1955,0.253239,43.126886
2023-857916,2023-06-22,000001,Vente,15000,,,AOULERE,B018,65130,65037,Artiguemy,65,,,650370000A0289,,,,,,,,,,,,,0,,,,,S,sols,,,60,0.252584,43.126704
2023-857916,2023-06-22,000001,Vente,15000,,,AOULERE,B018,65130,65037,Artiguemy,65,,,650370000A0290,,,,,,,,,,,,,0,,,,,L,landes,PATUR,Pâture plantée,1111,0.252872,43.126983
2023-857916,2023-06-22,000001,Vente,15000,,,AOULERE,B018,65130,65037,Artiguemy,65,,,650370000A0293,,,,,,,,,,,,,0,,,,,L,landes,PATUR,Pâture plantée,6171,0.253822,43.127596
2023-857916,2023-06-22,000001,Vente,15000,,,AOULERE,B018,65130,65037,Artiguemy,65,,,650370000A0294,,,,,,,,,,,,,0,,,,,L,landes,PATUR,Pâture plantée,6446,0.254583,43.127716
2023-857916,2023-06-22,000001,Vente,15000,,,AOULERE,B018,65130,65037,Artiguemy,65,,,650370000A0295,,,,,,,,,,,,,0,,,,,L,landes,PATUR,Pâture plantée,2885,0.254426,43.127075
2023-857916,2023-06-22,000001,Vente,15000,,,LANNE HREDE,B015,65130,65037,Artiguemy,65,,,650370000B0205,,,,,,,,,,,,,0,,,,,P,prés,,,2500,0.236977,43.12317
2023-857916,2023-06-22,000001,Vente,15000,,,COUSTALAT,B009,65130,65037,Artiguemy,65,,,650370000B0374,,,,,,,,,,,,,0,,,,,BF,futaies feuillues,CHENE,Chênes,1635,0.249575,43.123813
2023-857916,2023-06-22,000001,Vente,15000,,,COUSTALAT,B009,65130,65037,Artiguemy,65,,,650370000B0375,,,,,,,,,,,,,0,,,,,BF,futaies feuillues,CHENE,Chênes,2186,0.249825,43.123863
2023-857917,2023-06-26,000001,Vente,8000,,,LANNE HREDE,B015,65130,65037,Artiguemy,65,,,650370000B0152,,,,,,,,,,,,,0,,,,,P,prés,,,4637,0.235509,43.12342
2023-857917,2023-06-26,000001,Vente,8000,,,LANNE HREDE,B015,65130,65037,Artiguemy,65,,,650370000B0153,,,,,,,,,,,,,0,,,,,P,prés,,,5449,0.234672,43.123867
2023-857917,2023-06-26,000001,Vente,8000,,,LANNE HREDE,B015,65130,65037,Artiguemy,65,,,650370000B0154,,,,,,,,,,,,,0,,,,,T,terres,,,4416,0.235267,43.124219
2023-857923,2023-06-23,000001,Vente,7910,,,PUYO DAOUANT,B023,65130,65037,Artiguemy,65,,,650370000B0316,,,,,,,,,,,,,0,,,,,T,terres,,,6155,0.24637,43.125316
2023-857923,2023-06-23,000001,Vente,7910,,,PUYO DAOUANT,B023,65130,65037,Artiguemy,65,,,650370000B0317,,,,,,,,,,,,,0,,,,,P,prés,,,4410,0.24714,43.125121
2023-857923,2023-06-23,000001,Vente,7910,,,PUYO DAOUANT,B023,65130,65037,Artiguemy,65,,,650370000B0318,,,,,,,,,,,,,0,,,,,T,terres,,,2405,0.246993,43.125973
2023-857923,2023-06-23,000001,Vente,7910,,,COUSTALAT,B009,65130,65037,Artiguemy,65,,,650370000B0360,,,,,,,,,,,,,0,,,,,T,terres,,,2850,0.247313,43.124547
2023-859790,2023-09-21,000001,Vente,220,,,LATRINGUE,B016,65130,65037,Artiguemy,65,,,650370000A0257,,,,,,,,,,,,,0,,,,,L,landes,FRICH,Friche,2737,0.256769,43.125429
2023-859846,2023-09-21,000001,Vente,600,,,COUSTALAT,B009,65130,65037,Artiguemy,65,,,650370000B0369,,,,,,,,,,,,,0,,,,,BT,taillis simples,,,910,0.248687,43.123049
2023-859846,2023-09-21,000001,Vente,600,,,COUSTALAT,B009,65130,65037,Artiguemy,65,,,650370000B0380,,,,,,,,,,,,,0,,,,,L,landes,FRICH,Friche,650,0.250368,43.12361
2023-859846,2023-09-21,000001,Vente,600,,,COUSTALAT,B009,65130,65037,Artiguemy,65,,,650370000B0382,,,,,,,,,,,,,0,,,,,L,landes,FRICH,Friche,940,0.250277,43.123506
2023-859846,2023-09-21,000001,Vente,600,,,COUSTALAT,B009,65130,65037,Artiguemy,65,,,650370000B0387,,,,,,,,,,,,,0,,,,,L,landes,FRICH,Friche,1919,0.249873,43.122801
2023-859849,2023-09-21,000001,Vente,980,,,COURREGES,B008,65130,65037,Artiguemy,65,,,650370000A0340,,,,,,,,,,,,,0,,,,,L,landes,FRICH,Friche,1101,0.251854,43.126827
2023-859849,2023-09-21,000001,Vente,980,,,COURREGES,B008,65130,65037,Artiguemy,65,,,650370000A0341,,,,,,,,,,,,,0,,,,,L,landes,FRICH,Friche,1134,0.25231,43.126831
2023-859849,2023-09-21,000001,Vente,980,,,COUSTALAT,B009,65130,65037,Artiguemy,65,,,650370000B0416,,,,,,,,,,,,,0,,,,,T,terres,,,2170,0.24507,43.122965
2023-859851,2023-09-21,000001,Vente,46600,,,LANNE HREDE,B015,65130,65037,Artiguemy,65,,,650370000B0248,,,,,,,,,,,,,0,,,,,T,terres,,,1393,0.241835,43.123678
2023-859851,2023-09-21,000001,Vente,46600,,,LANNE HREDE,B015,65130,65037,Artiguemy,65,,,650370000B0254,,,,,,,,,,,,,0,,,,,T,terres,,,3160,0.241419,43.123587
2023-859851,2023-09-21,000001,Vente,46600,,,LANNE HREDE,B015,65130,65037,Artiguemy,65,,,650370000B0255,,,,,,,,,,,,,0,,,,,P,prés,,,829,0.242175,43.123373
2023-859851,2023-09-21,000001,Vente,46600,,,CABARROU,B006,65130,65037,Artiguemy,65,,,650370000B0283,,,,,,,,,,,,,0,,,,,T,terres,,,1724,0.242523,43.123057
2023-859851,2023-09-21,000001,Vente,46600,,,CABARROU,B006,65130,65037,Artiguemy,65,,,650370000B0284,,,,,,,,,,,,,0,,,,,P,prés,,,1012,0.242877,43.123085
2023-859853,2023-09-21,000001,Vente,500,,,L EGLISE,B011,65130,65037,Artiguemy,65,,,650370000A0120,,,,,,,,,,,,,0,,,,,L,landes,PATUR,Pâture plantée,6037,0.251171,43.131362
