id_mutation,date_mutation,numero_disposition,nature_mutation,valeur_fonciere,adresse_numero,adresse_suffixe,adresse_nom_voie,adresse_code_voie,code_postal,code_commune,nom_commune,code_departement,ancien_code_commune,ancien_nom_commune,id_parcelle,ancien_id_parcelle,numero_volume,lot1_numero,lot1_surface_carrez,lot2_numero,lot2_surface_carrez,lot3_numero,lot3_surface_carrez,lot4_numero,lot4_surface_carrez,lot5_numero,lot5_surface_carrez,nombre_lots,code_type_local,type_local,surface_reelle_bati,nombre_pieces_principales,code_nature_culture,nature_culture,code_nature_culture_speciale,nature_culture_speciale,surface_terrain,longitude,latitude
2023-855756,2023-02-21,000001,Vente,270000,,,LES MASSEYS,B042,65330,65183,Galan,65,,,651830000E0529,,,,,,,,,,,,,0,,,,,S,sols,,,50,0.409173,43.209973
2023-855756,2023-02-21,000001,Vente,270000,,,LES MASSEYS,B042,65330,65183,Galan,65,,,651830000E0529,,,,,,,,,,,,,0,,,,,P,prés,,,2485,0.409173,43.209973
2023-855756,2023-02-21,000001,Vente,270000,27,,RUE DE HOUNTAGNERE,0160,65330,65183,Galan,65,,,651830000E0530,,,,,,,,,,,,,0,1,Maison,105,2,S,sols,,,1060,0.409042,43.210061
2023-855756,2023-02-21,000001,Vente,270000,,,LES MASSEYS,B042,65330,65183,Galan,65,,,651830000E0531,,,,,,,,,,,,,0,,,,,S,sols,,,40,0.409041,43.210303
2023-855756,2023-02-21,000001,Vente,270000,,,LES MASSEYS,B042,65330,65183,Galan,65,,,651830000E0531,,,,,,,,,,,,,0,,,,,VI,vignes,,,707,0.409041,43.210303
2023-855756,2023-02-21,000001,Vente,270000,,,LES MASSEYS,B042,65330,65183,Galan,65,,,651830000E0531,,,,,,,,,,,,,0,,,,,J,jardins,,,863,0.409041,43.210303
2023-855756,2023-02-21,000001,Vente,270000,,,LES MASSEYS,B042,65330,65183,Galan,65,,,651830000E0532,,,,,,,,,,,,,0,,,,,S,sols,,,15,0.409462,43.210427
2023-855756,2023-02-21,000001,Vente,270000,,,LES MASSEYS,B042,65330,65183,Galan,65,,,651830000E0532,,,,,,,,,,,,,0,,,,,T,terres,,,3313,0.409462,43.210427
2023-855756,2023-02-21,000001,Vente,270000,,,LES MASSEYS,B042,65330,65183,Galan,65,,,65183000WD0044,,,,,,,,,,,,,0,,,,,P,prés,,,5200,0.409776,43.208143
2023-855756,2023-02-21,000001,Vente,270000,,,LES MASSEYS,B042,65330,65183,Galan,65,,,65183000WD0146,,,,,,,,,,,,,0,,,,,P,prés,,,22657,0.410001,43.209128
2023-855821,2023-03-03,000001,Vente,1000,2,,IMP MOULIN DE CAZENEUVE,0210,65330,65183,Galan,65,,,651830000E0014,,,,,,,,,,,,,0,3,Dépendance,,0,S,sols,,,417,0.402594,43.223045
2023-855821,2023-03-03,000001,Vente,1000,2,,IMP MOULIN DE CAZENEUVE,0210,65330,65183,Galan,65,,,651830000E0014,,,,,,,,,,,,,0,3,Dépendance,,0,S,sols,,,417,0.402594,43.223045
2023-856416,2023-03-21,000001,Vente,96000,4,,RUE DE LA VOIE ROMAINE,0330,65330,65183,Galan,65,,,651830000E0789,,,,,,,,,,,,,0,3,Dépendance,,0,S,sols,,,800,0.405077,43.214619
2023-856416,2023-03-21,000001,Vente,96000,4,,RUE DE LA VOIE ROMAINE,0330,65330,65183,Galan,65,,,651830000E0789,,,,,,,,,,,,,0,1,Maison,90,5,S,sols,,,800,0.405077,43.214619
2023-856416,2023-03-21,000001,Vente,96000,4,,RUE DE LA VOIE ROMAINE,0330,65330,65183,Galan,65,,,651830000E0789,,,,,,,,,,,,,0,3,Dépendance,,0,S,sols,,,800,0.405077,43.214619
2023-857053,2023-05-03,000001,Vente,189870,3,,RUE DU FRERE JEAN,0140,65330,65183,Galan,65,,,651830000E0838,,,,,,,,,,,,,0,1,Maison,248,3,S,sols,,,379,0.406564,43.221871
2023-857096,2023-05-03,000001,Vente,44000,,,LES MASSEYS,B042,65330,65183,Galan,65,,,65183000WD0092,,,,,,,,,,,,,0,,,,,T,terres,,,560,0.409725,43.215583
2023-857096,2023-05-03,000001,Vente,44000,13,,RUE DES MASSEYS,0195,65330,65183,Galan,65,,,65183000WD0093,,,,,,,,,,,,,0,1,Maison,60,2,S,sols,,,432,0.40977,43.21574
2023-857096,2023-05-03,000001,Vente,44000,,,LES MASSEYS,B042,65330,65183,Galan,65,,,65183000WD0097,,,,,,,,,,,,,0,,,,,T,terres,,,520,0.409574,43.215929
2023-857096,2023-05-03,000001,Vente,44000,,,LES MASSEYS,B042,65330,65183,Galan,65,,,65183000WD0098,,,,,,,,,,,,,0,,,,,J,jardins,,,561,0.409789,43.215884
2023-857096,2023-05-03,000001,Vente,44000,,,LES MASSEYS,B042,65330,65183,Galan,65,,,65183000WD0099,,,,,,,,,,,,,0,,,,,S,sols,,,30,0.409881,43.215773
2023-857240,2023-05-16,000001,Vente,90000,,,LES MASSEYS,B042,65330,65183,Galan,65,,,65183000WD0060,,,,,,,,,,,,,0,,,,,S,sols,,,230,0.411425,43.214661
2023-857240,2023-05-16,000001,Vente,90000,,,LES MASSEYS,B042,65330,65183,Galan,65,,,65183000WD0060,,,,,,,,,,,,,0,,,,,L,landes,FRICH,Friche,2800,0.411425,43.214661
2023-857240,2023-05-16,000001,Vente,90000,,,LES MASSEYS,B042,65330,65183,Galan,65,,,65183000WD0060,,,,,,,,,,,,,0,,,,,P,prés,,,7664,0.411425,43.214661
2023-857240,2023-05-16,000001,Vente,90000,,,LES MASSEYS,B042,65330,65183,Galan,65,,,65183000WD0060,,,,,,,,,,,,,0,,,,,P,prés,,,24543,0.411425,43.214661
2023-857240,2023-05-16,000001,Vente,90000,21,,RUE DES MASSEYS,0195,65330,65183,Galan,65,,,65183000WD0091,,,,,,,,,,,,,0,1,Maison,130,3,B,bois,CHAT,Châtaigneraie,1087,0.409949,43.215389
2023-857240,2023-05-16,000001,Vente,90000,21,,RUE DES MASSEYS,0195,65330,65183,Galan,65,,,65183000WD0091,,,,,,,,,,,,,0,1,Maison,130,3,S,sols,,,2812,0.409949,43.215389
2023-857240,2023-05-16,000001,Vente,90000,,,LES MASSEYS,B042,65330,65183,Galan,65,,,65183000WD0095,,,,,,,,,,,,,0,,,,,J,jardins,,,30,0.410078,43.215581
2023-857649,2023-06-02,000001,Vente,55000,44,,RUE D ETIGNY,0120,65330,65183,Galan,65,,,651830000E0319,,,,,,,,,,,,,0,3,Dépendance,,0,S,sols,,,753,0.405901,43.21641
2023-857649,2023-06-02,000001,Vente,55000,44,,RUE D ETIGNY,0120,65330,65183,Galan,65,,,651830000E0319,,,,,,,,,,,,,0,3,Dépendance,,0,S,sols,,,753,0.405901,43.21641
2023-857649,2023-06-02,000001,Vente,55000,44,,RUE D ETIGNY,0120,65330,65183,Galan,65,,,651830000E0319,,,,,,,,,,,,,0,1,Maison,220,6,S,sols,,,753,0.405901,43.21641
2023-857649,2023-06-02,000001,Vente,55000,44,,RUE D ETIGNY,0120,65330,65183,Galan,65,,,651830000E0319,,,,,,,,,,,,,0,3,Dépendance,,0,S,sols,,,753,0.405901,43.21641
2023-857649,2023-06-02,000001,Vente,55000,,,LAMARQUE,B033,65330,65183,Galan,65,,,651830000E0942,,,,,,,,,,,,,0,,,,,S,sols,,,142,0.405848,43.216503
2023-857838,2023-06-29,000001,Vente,150000,20,,RUE DES MASSEYS,0195,65330,65183,Galan,65,,,651830000E0897,,,,,,,,,,,,,0,1,Maison,102,5,S,sols,,,1685,0.408178,43.213152
2023-857838,2023-06-29,000001,Vente,150000,20,,RUE DES MASSEYS,0195,65330,65183,Galan,65,,,651830000E0897,,,,,,,,,,,,,0,3,Dépendance,,0,S,sols,,,1685,0.408178,43.213152
2023-857999,2023-06-14,000001,Vente,80000,18,,RUE DE LA BIGORRE,0060,65330,65183,Galan,65,,,651830000E0901,,,,,,,,,,,,,0,1,Maison,90,4,S,sols,,,558,0.404854,43.211562
2023-857999,2023-06-14,000001,Vente,80000,,,PEYREMALE,B052,65330,65183,Galan,65,,,651830000E0907,,,,,,,,,,,,,0,,,,,J,jardins,,,727,0.404378,43.211619
2023-858589,2023-07-25,000001,Vente,1000,,,BARRASQUET,B002,65330,65183,Galan,65,,,65183000WH0026,,,,,,,,,,,,,0,,,,,BT,taillis simples,,,3780,0.395843,43.21845
2023-858589,2023-07-25,000001,Vente,1000,,,BARRASQUET,B002,65330,65183,Galan,65,,,65183000WH0026,,,,,,,,,,,,,0,,,,,T,terres,,,2178,0.395843,43.21845
2023-858924,2023-08-17,000001,Vente,54160,,,BISTOS,B007,65330,65183,Galan,65,,,65183000WI0075,,,,,,,,,,,,,0,,,,,BT,taillis simples,,,42617,0.385142,43.213481
2023-858924,2023-08-17,000001,Vente,54160,,,BISTOS,B007,65330,65183,Galan,65,,,65183000WI0075,,,,,,,,,,,,,0,,,,,P,prés,,,30000,0.385142,43.213481
2023-858924,2023-08-17,000001,Vente,54160,,,BISTOS,B007,65330,65183,Galan,65,,,65183000WI0076,,,,,,,,,,,,,0,,,,,S,sols,,,1263,0.385347,43.212901
2023-858924,2023-08-17,000001,Vente,54160,,,BISTOS,B007,65330,65183,Galan,65,,,65183000WI0076,,,,,,,,,,,,,0,,,,,T,terres,,,2000,0.385347,43.212901
2023-859035,2023-08-24,000001,Vente,4000,,,PICHARRAOU,B055,65330,65183,Galan,65,,,65183000WE0050,,,,,,,,,,,,,0,,,,,T,terres,,,9929,0.401091,43.210782
2023-859051,2023-08-11,000001,Vente,3000,,,LAMARQUE,B033,65330,65183,Galan,65,,,651830000E0240,,,,,,,,,,,,,0,,,,,S,sols,,,110,0.405723,43.219433
2023-859051,2023-08-11,000001,Vente,3000,,,LAMARQUE,B033,65330,65183,Galan,65,,,651830000E0241,,,,,,,,,,,,,0,,,,,P,prés,,,837,0.405036,43.219431
2023-859051,2023-08-11,000001,Vente,3000,,,LAMARQUE,B033,65330,65183,Galan,65,,,651830000E1012,,,,,,,,,,,,,0,,,,,P,prés,,,1740,0.405169,43.219521
2023-859051,2023-08-11,000001,Vente,3000,,,LAMARQUE,B033,65330,65183,Galan,65,,,651830000E1015,,,,,,,,,,,,,0,,,,,P,prés,,,718,0.404982,43.219638
2023-859051,2023-08-11,000001,Vente,3000,,,LAMARQUE,B033,65330,65183,Galan,65,,,651830000E1018,,,,,,,,,,,,,0,,,,,S,sols,,,30,0.40552,43.219653
2023-859861,2023-10-06,000001,Vente,164251,1,,RUE DES MASSEYS,0195,65330,65183,Galan,65,,,65183000WD0110,,,,,,,,,,,,,0,3,Dépendance,,0,S,sols,,,2210,0.410326,43.217836
2023-859861,2023-10-06,000001,Vente,164251,1,,RUE DES MASSEYS,0195,65330,65183,Galan,65,,,65183000WD0110,,,,,,,,,,,,,0,1,Maison,96,5,S,sols,,,2210,0.410326,43.217836
2023-860569,2023-11-28,000001,Vente,117000,,,LA BARSOGUE,B003,65330,65183,Galan,65,,,65183000WD0069,,,,,,,,,,,,,0,,,,,P,prés,,,316,0.41508,43.218343
2023-860569,2023-11-28,000001,Vente,117000,,,LA BARSOGUE,B003,65330,65183,Galan,65,,,65183000WD0071,,,,,,,,,,,,,0,,,,,BT,taillis simples,,,614,0.414657,43.218895
2023-860569,2023-11-28,000001,Vente,117000,9,,IMP DU BATAN,0035,65330,65183,Galan,65,,,65183000WD0082,,,,,,,,,,,,,0,1,Maison,150,5,P,prés,,,71303,0.414816,43.222108
2023-860569,2023-11-28,000001,Vente,117000,9,,IMP DU BATAN,0035,65330,65183,Galan,65,,,65183000WD0082,,,,,,,,,,,,,0,3,Dépendance,,0,J,jardins,,,995,0.414816,43.222108
2023-860569,2023-11-28,000001,Vente,117000,9,,IMP DU BATAN,0035,65330,65183,Galan,65,,,65183000WD0082,,,,,,,,,,,,,0,1,Maison,150,5,J,jardins,,,995,0.414816,43.222108
2023-860569,2023-11-28,000001,Vente,117000,9,,IMP DU BATAN,0035,65330,65183,Galan,65,,,65183000WD0082,,,,,,,,,,,,,0,3,Dépendance,,0,S,sols,,,3000,0.414816,43.222108
2023-860569,2023-11-28,000001,Vente,117000,9,,IMP DU BATAN,0035,65330,65183,Galan,65,,,65183000WD0082,,,,,,,,,,,,,0,1,Maison,150,5,S,sols,,,3000,0.414816,43.222108
2023-860569,2023-11-28,000001,Vente,117000,9,,IMP DU BATAN,0035,65330,65183,Galan,65,,,65183000WD0082,,,,,,,,,,,,,0,3,Dépendance,,0,P,prés,,,71303,0.414816,43.222108
2023-860571,2023-11-28,000001,Vente,50600,,,LE POUY,B058,65330,65183,Galan,65,,,651830000D0033,,,,,,,,,,,,,0,,,,,BT,taillis simples,,,1736,0.41847,43.219565
2023-860571,2023-11-28,000001,Vente,50600,,,REBISPLES,B060,65330,65183,Galan,65,,,651830000D0462,,,,,,,,,,,,,0,,,,,BT,taillis simples,,,59,0.416915,43.219457
2023-860571,2023-11-28,000001,Vente,50600,,,LAMARQUE,B033,65330,65183,Galan,65,,,651830000E0340,,,,,,,,,,,,,0,,,,,J,jardins,,,796,0.407219,43.217707
2023-860571,2023-11-28,000001,Vente,50600,,,LAMARQUE,B033,65330,65183,Galan,65,,,651830000E0341,,,,,,,,,,,,,0,,,,,S,sols,,,605,0.406931,43.217752
2023-860571,2023-11-28,000001,Vente,50600,,,LAMARQUE,B033,65330,65183,Galan,65,,,651830000E0342,,,,,,,,,,,,,0,,,,,T,terres,,,3620,0.407241,43.217469
2023-860571,2023-11-28,000001,Vente,50600,,,LAMARQUE,B033,65330,65183,Galan,65,,,651830000E0343,,,,,,,,,,,,,0,,,,,T,terres,,,2326,0.408392,43.217296
2023-860571,2023-11-28,000001,Vente,50600,,,LE POUY,B058,65330,65183,Galan,65,,,65183000WD0015,,,,,,,,,,,,,0,,,,,P,prés,,,4019,0.417291,43.220118
2023-860571,2023-11-28,000001,Vente,50600,,,LE POUY,B058,65330,65183,Galan,65,,,65183000WD0015,,,,,,,,,,,,,0,,,,,BS,taillis sous futaie,,,18300,0.417291,43.220118
2023-860571,2023-11-28,000001,Vente,50600,,,REBISPLES,B060,65330,65183,Galan,65,,,65183000WD0016,,,,,,,,,,,,,0,,,,,P,prés,,,5604,0.415707,43.219204
2023-860571,2023-11-28,000001,Vente,50600,,,LA BARSOGUE,B003,65330,65183,Galan,65,,,65183000WD0081,,,,,,,,,,,,,0,,,,,T,terres,,,15539,0.414806,43.220927
2023-860587,2023-11-10,000001,Vente,25000,11,,PL DE LA BASTIDE,0030,65330,65183,Galan,65,,,651830000E0147,,,,,,,,,,,,,0,2,Appartement,70,3,S,sols,,,172,0.407342,43.222625
2023-860587,2023-11-10,000001,Vente,25000,11,,PL DE LA BASTIDE,0030,65330,65183,Galan,65,,,651830000E0147,,,,,,,,,,,,,0,3,Dépendance,,0,S,sols,,,172,0.407342,43.222625
2023-860587,2023-11-10,000001,Vente,25000,11,,PL DE LA BASTIDE,0030,65330,65183,Galan,65,,,651830000E0147,,,,,,,,,,,,,0,2,Appartement,53,3,S,sols,,,172,0.407342,43.222625
2023-860587,2023-11-10,000001,Vente,25000,11,,PL DE LA BASTIDE,0030,65330,65183,Galan,65,,,651830000E0147,,,,,,,,,,,,,0,3,Dépendance,,0,S,sols,,,172,0.407342,43.222625
2023-860718,2023-11-28,000001,Vente,191721,12,,RUE DE HOUNTAGNERE,0160,65330,65183,Galan,65,,,651830000E1095,,,,,,,,,,,,,0,3,Dépendance,,0,S,sols,,,1430,0.407356,43.212222
2023-860718,2023-11-28,000001,Vente,191721,12,,RUE DE HOUNTAGNERE,0160,65330,65183,Galan,65,,,651830000E1095,,,,,,,,,,,,,0,1,Maison,100,5,S,sols,,,1430,0.407356,43.212222
2023-860718,2023-11-28,000001,Vente,191721,,,LES MASSEYS,B042,65330,65183,Galan,65,,,651830000E1096,,,,,,,,,,,,,0,,,,,AG,terrains d'agrément,,,1100,0.40724,43.212515
