id_mutation,date_mutation,numero_disposition,nature_mutation,valeur_fonciere,adresse_numero,adresse_suffixe,adresse_nom_voie,adresse_code_voie,code_postal,code_commune,nom_commune,code_departement,ancien_code_commune,ancien_nom_commune,id_parcelle,ancien_id_parcelle,numero_volume,lot1_numero,lot1_surface_carrez,lot2_numero,lot2_surface_carrez,lot3_numero,lot3_surface_carrez,lot4_numero,lot4_surface_carrez,lot5_numero,lot5_surface_carrez,nombre_lots,code_type_local,type_local,surface_reelle_bati,nombre_pieces_principales,code_nature_culture,nature_culture,code_nature_culture_speciale,nature_culture_speciale,surface_terrain,longitude,latitude
2023-855307,2023-01-21,000002,Vente,7500,,,LATUHERE,B048,65130,65306,Mauvezin,65,,,653060000B0384,,,,,,,,,,,,,0,,,,,P,prés,,,426,0.292467,43.115424
2023-855526,2023-02-10,000001,Vente,57400,15,,CHE DE LA SERRE,0055,65130,65306,Mauvezin,65,,,653060000A0254,,,,,,,,,,,,,0,3,Dépendance,,0,S,sols,,,1440,0.308247,43.130838
2023-855526,2023-02-10,000001,Vente,57400,15,,CHE DE LA SERRE,0055,65130,65306,Mauvezin,65,,,653060000A0254,,,,,,,,,,,,,0,3,Dépendance,,0,S,sols,,,1440,0.308247,43.130838
2023-855526,2023-02-10,000001,Vente,57400,15,,CHE DE LA SERRE,0055,65130,65306,Mauvezin,65,,,653060000A0254,,,,,,,,,,,,,0,1,Maison,46,3,S,sols,,,1440,0.308247,43.130838
2023-855526,2023-02-10,000001,Vente,57400,,,COURREGES DESSUS,B021,65130,65306,Mauvezin,65,,,653060000A0315,,,,,,,,,,,,,0,,,,,T,terres,,,1200,0.307841,43.130527
2023-855728,2023-02-20,000001,Vente,30000,,,RTE ST JACQUES DE COMPOSTELLE,0060,65130,65306,Mauvezin,65,,,653060000D0660,,,,,,,,,,,,,0,3,Dépendance,,0,S,sols,,,957,0.262856,43.110228
2023-858263,2023-06-29,000001,Vente,2000,,,COURREGES DEBAT,B020,65130,65306,Mauvezin,65,,,653060000A0368,,,,,,,,,,,,,0,,,,,L,landes,PATUR,Pâture plantée,656,0.304723,43.128113
2023-858263,2023-06-29,000001,Vente,2000,,,COURREGES DEBAT,B020,65130,65306,Mauvezin,65,,,653060000A0386,,,,,,,,,,,,,0,,,,,T,terres,,,2263,0.304288,43.128527
2023-858263,2023-06-29,000001,Vente,2000,,,COURREGES DEBAT,B020,65130,65306,Mauvezin,65,,,653060000A0388,,,,,,,,,,,,,0,,,,,P,prés,,,1753,0.304189,43.128172
2023-860190,2023-10-11,000001,Vente,2500,,,BEYRIERE,B005,65130,65306,Mauvezin,65,,,653060000A0229,,,,,,,,,,,,,0,,,,,P,prés,,,6660,0.275281,43.129831
2023-860190,2023-10-11,000001,Vente,2500,,,HONT CONDAOU,B035,65130,65306,Mauvezin,65,,,653060000D0048,,,,,,,,,,,,,0,,,,,P,prés,,,2633,0.27331,43.130477
2023-860190,2023-10-11,000001,Vente,2500,,,HONT CONDAOU,B035,65130,65306,Mauvezin,65,,,653060000D0049,,,,,,,,,,,,,0,,,,,P,prés,,,3097,0.274604,43.130254
2023-860374,2023-10-27,000001,Vente,2000,,,CONDOURINOT,B017,65130,65306,Mauvezin,65,,,653060000A0198,,,,,,,,,,,,,0,,,,,T,terres,,,4592,0.295744,43.132294
2023-860374,2023-10-27,000001,Vente,2000,,,HUBAREITE,B045,65130,65306,Mauvezin,65,,,653060000A0440,,,,,,,,,,,,,0,,,,,T,terres,,,1771,0.302461,43.129759
2023-860748,2023-12-11,000001,Vente,91324,65,,RUE GASTON FEBUS,0045,65130,65306,Mauvezin,65,,,653060000B0287,,,,,,,,,,,,,0,1,Maison,110,4,S,sols,,,394,0.289116,43.113707
2023-860748,2023-12-11,000001,Vente,91324,,,TACHOUERE,B065,65130,65306,Mauvezin,65,,,653060000B0288,,,,,,,,,,,,,0,,,,,S,sols,,,408,0.289163,43.113859
2023-860748,2023-12-11,000001,Vente,91324,,,TACHOUERE,B065,65130,65306,Mauvezin,65,,,653060000B0289,,,,,,,,,,,,,0,,,,,P,prés,,,2895,0.289129,43.11416
2023-860748,2023-12-11,000001,Vente,91324,,,TACHOUERE,B065,65130,65306,Mauvezin,65,,,653060000B0289,,,,,,,,,,,,,0,,,,,S,sols,,,20,0.289129,43.11416
2023-861206,2023-12-21,000001,Vente,10000,,,PIALAT,B056,65130,65306,Mauvezin,65,,,653060000B0153,,,,,,,,,,,,,0,,,,,T,terres,,,5618,0.290459,43.116306
2023-861206,2023-12-21,000001,Vente,10000,,,PIALAT,B056,65130,65306,Mauvezin,65,,,653060000B0154,,,,,,,,,,,,,0,,,,,P,prés,,,1855,0.291156,43.116185
2023-861206,2023-12-21,000001,Vente,10000,,,TACHOUERE,B065,65130,65306,Mauvezin,65,,,653060000B0290,,,,,,,,,,,,,0,,,,,P,prés,,,2720,0.289102,43.114596
2023-861206,2023-12-21,000001,Vente,10000,,,TACHOUERE,B065,65130,65306,Mauvezin,65,,,653060000B0299,,,,,,,,,,,,,0,,,,,P,prés,,,2638,0.290068,43.115403
2023-861206,2023-12-21,000001,Vente,10000,,,TACHOUERE,B065,65130,65306,Mauvezin,65,,,653060000B0300,,,,,,,,,,,,,0,,,,,T,terres,,,5288,0.289924,43.115974
