id_mutation,date_mutation,numero_disposition,nature_mutation,valeur_fonciere,adresse_numero,adresse_suffixe,adresse_nom_voie,adresse_code_voie,code_postal,code_commune,nom_commune,code_departement,ancien_code_commune,ancien_nom_commune,id_parcelle,ancien_id_parcelle,numero_volume,lot1_numero,lot1_surface_carrez,lot2_numero,lot2_surface_carrez,lot3_numero,lot3_surface_carrez,lot4_numero,lot4_surface_carrez,lot5_numero,lot5_surface_carrez,nombre_lots,code_type_local,type_local,surface_reelle_bati,nombre_pieces_principales,code_nature_culture,nature_culture,code_nature_culture_speciale,nature_culture_speciale,surface_terrain,longitude,latitude
2023-855599,2023-02-15,000001,Vente,164350,,,HAVERE,B029,65220,65383,Sadournin,65,,,653830000A0038,,,,,,,,,,,,,0,,,,,BS,taillis sous futaie,,,2520,0.392723,43.321994
2023-855599,2023-02-15,000001,Vente,164350,,,BAZEILLAC,B009,65220,65383,Sadournin,65,,,653830000A0135,,,,,,,,,,,,,0,,,,,T,terres,,,26965,0.393537,43.332237
2023-855599,2023-02-15,000001,Vente,164350,,,BAZEILLAC,B009,65220,65383,Sadournin,65,,,653830000A0156,,,,,,,,,,,,,0,,,,,S,sols,,,40,0.392095,43.334189
2023-855599,2023-02-15,000001,Vente,164350,,,BAZEILLAC,B009,65220,65383,Sadournin,65,,,653830000A0156,,,,,,,,,,,,,0,,,,,P,prés,,,1870,0.392095,43.334189
2023-855599,2023-02-15,000001,Vente,164350,,,BAZEILLAC,B009,65220,65383,Sadournin,65,,,653830000A0159,,,,,,,,,,,,,0,,,,,T,terres,,,2540,0.392048,43.333296
2023-855599,2023-02-15,000001,Vente,164350,,,BAZEILLAC,B009,65220,65383,Sadournin,65,,,653830000A0160,,,,,,,,,,,,,0,,,,,T,terres,,,10735,0.392775,43.334114
2023-855599,2023-02-15,000001,Vente,164350,,,BAZEILLAC,B009,65220,65383,Sadournin,65,,,653830000A0161,,,,,,,,,,,,,0,,,,,T,terres,,,55595,0.394163,43.333597
2023-855599,2023-02-15,000001,Vente,164350,,,BAZEILLAC,B009,65220,65383,Sadournin,65,,,653830000A0318,,,,,,,,,,,,,0,,,,,T,terres,,,41246,0.391735,43.334291
2023-855599,2023-02-15,000001,Vente,164350,,,BAZEILLAC,B009,65220,65383,Sadournin,65,,,653830000A0318,,,,,,,,,,,,,0,,,,,S,sols,,,77,0.391735,43.334291
2023-855599,2023-02-15,000001,Vente,164350,,,BAZEILLAC,B009,65220,65383,Sadournin,65,,,653830000A0384,,,,,,,,,,,,,0,,,,,T,terres,,,28480,0.398392,43.33008
2023-856412,2023-03-17,000001,Vente,71216,,,LESTAQUE,B041,65220,65383,Sadournin,65,,,65383000ZD0062,,,,,,,,,,,,,0,,,,,T,terres,,,127,0.415919,43.303437
2023-856747,2023-04-18,000001,Vente,275000,10,,CHE DE L ECOLE,0050,65220,65383,Sadournin,65,,,653830000B1320,,,,,,,,,,,,,0,3,Dépendance,,0,P,prés,,,5580,0.401369,43.31484
2023-856747,2023-04-18,000001,Vente,275000,10,,CHE DE L ECOLE,0050,65220,65383,Sadournin,65,,,653830000B1320,,,,,,,,,,,,,0,3,Dépendance,,0,P,prés,,,5580,0.401369,43.31484
2023-856747,2023-04-18,000001,Vente,275000,10,,CHE DE L ECOLE,0050,65220,65383,Sadournin,65,,,653830000B1320,,,,,,,,,,,,,0,3,Dépendance,,0,P,prés,,,5580,0.401369,43.31484
2023-856747,2023-04-18,000001,Vente,275000,10,,CHE DE L ECOLE,0050,65220,65383,Sadournin,65,,,653830000B1320,,,,,,,,,,,,,0,3,Dépendance,,0,P,prés,,,5580,0.401369,43.31484
2023-856747,2023-04-18,000001,Vente,275000,10,,CHE DE L ECOLE,0050,65220,65383,Sadournin,65,,,653830000B1320,,,,,,,,,,,,,0,3,Dépendance,,0,S,sols,,,2000,0.401369,43.31484
2023-856747,2023-04-18,000001,Vente,275000,10,,CHE DE L ECOLE,0050,65220,65383,Sadournin,65,,,653830000B1320,,,,,,,,,,,,,0,3,Dépendance,,0,S,sols,,,2000,0.401369,43.31484
2023-856747,2023-04-18,000001,Vente,275000,10,,CHE DE L ECOLE,0050,65220,65383,Sadournin,65,,,653830000B1320,,,,,,,,,,,,,0,3,Dépendance,,0,S,sols,,,2000,0.401369,43.31484
2023-856747,2023-04-18,000001,Vente,275000,10,,CHE DE L ECOLE,0050,65220,65383,Sadournin,65,,,653830000B1320,,,,,,,,,,,,,0,3,Dépendance,,0,S,sols,,,2000,0.401369,43.31484
2023-856747,2023-04-18,000001,Vente,275000,10,,CHE DE L ECOLE,0050,65220,65383,Sadournin,65,,,653830000B1320,,,,,,,,,,,,,0,1,Maison,80,3,S,sols,,,2000,0.401369,43.31484
2023-856747,2023-04-18,000001,Vente,275000,10,,CHE DE L ECOLE,0050,65220,65383,Sadournin,65,,,653830000B1320,,,,,,,,,,,,,0,1,Maison,80,3,P,prés,,,5580,0.401369,43.31484
2023-856861,2023-05-09,000001,Vente,29822,,,DARRE GOULOURMA,B018,65220,65383,Sadournin,65,,,653830000B0928,,,,,,,,,,,,,0,,,,,T,terres,,,29822,0.434778,43.325493
2023-858190,2023-07-04,000001,Vente,10304.96,,,SAINT MARTIN,B058,65220,65383,Sadournin,65,,,653830000B0887,,,,,,,,,,,,,0,,,,,VI,vignes,,,2956,0.406097,43.329621
2023-858190,2023-07-04,000001,Vente,10304.96,,,SAINT MARTIN,B058,65220,65383,Sadournin,65,,,653830000B0991,,,,,,,,,,,,,0,,,,,T,terres,,,2369,0.405283,43.32969
2023-858190,2023-07-04,000001,Vente,10304.96,,,SAINT MARTIN,B058,65220,65383,Sadournin,65,,,653830000B0992,,,,,,,,,,,,,0,,,,,T,terres,,,4435,0.407033,43.329506
2023-860741,2023-12-06,000001,Vente,263000,104,,CHE DES GANDES,0070,65220,65383,Sadournin,65,,,653830000D0140,,,,,,,,,,,,,0,1,Maison,63,3,S,sols,,,1765,0.393649,43.306222
2023-860741,2023-12-06,000001,Vente,263000,,,GANDES,B024,65220,65383,Sadournin,65,,,653830000D0353,,,,,,,,,,,,,0,,,,,S,sols,,,1515,0.393712,43.306456
2023-860744,2023-11-30,000001,Vente,176810,81,,CHE DU BEDAT,0030,65220,65383,Sadournin,65,,,65383000ZA0022,,,,,,,,,,,,,0,1,Maison,138,4,S,sols,,,1577,0.417992,43.311286
2023-860744,2023-11-30,000001,Vente,176810,81,,CHE DU BEDAT,0030,65220,65383,Sadournin,65,,,65383000ZA0022,,,,,,,,,,,,,0,3,Dépendance,,0,S,sols,,,1577,0.417992,43.311286
2023-860773,2023-11-23,000001,Vente,28110,,,L ANCLAT,B002,65220,65383,Sadournin,65,,,653830000A0290,,,,,,,,,,,,,0,,,,,T,terres,,,1310,0.399746,43.3178
2023-860773,2023-11-23,000001,Vente,28110,,,L ANCLAT,B002,65220,65383,Sadournin,65,,,653830000A0350,,,,,,,,,,,,,0,,,,,T,terres,,,191,0.399191,43.318043
2023-860773,2023-11-23,000001,Vente,28110,,,L ANCLAT,B002,65220,65383,Sadournin,65,,,653830000A0353,,,,,,,,,,,,,0,,,,,T,terres,,,1310,0.399253,43.317811
2023-860898,2023-12-14,000001,Vente,3000,,,GANDES,B024,65220,65383,Sadournin,65,,,653830000D0146,,,,,,,,,,,,,0,,,,,P,prés,,,4440,0.392247,43.308558
