id_mutation,date_mutation,numero_disposition,nature_mutation,valeur_fonciere,adresse_numero,adresse_suffixe,adresse_nom_voie,adresse_code_voie,code_postal,code_commune,nom_commune,code_departement,ancien_code_commune,ancien_nom_commune,id_parcelle,ancien_id_parcelle,numero_volume,lot1_numero,lot1_surface_carrez,lot2_numero,lot2_surface_carrez,lot3_numero,lot3_surface_carrez,lot4_numero,lot4_surface_carrez,lot5_numero,lot5_surface_carrez,nombre_lots,code_type_local,type_local,surface_reelle_bati,nombre_pieces_principales,code_nature_culture,nature_culture,code_nature_culture_speciale,nature_culture_speciale,surface_terrain,longitude,latitude
2023-964901,2023-01-04,000001,Vente en l'état futur d'achèvement,369707,,,RUE DE PIERRE LONGUE,0206,74800,74007,Amancy,74,,,740070000B3397,,,5,,,,,,,,,,1,,,,,,,,,,6.345666,46.071311
2023-964901,2023-01-04,000001,Vente en l'état futur d'achèvement,369707,,,RUE DE PIERRE LONGUE,0206,74800,74007,Amancy,74,,,740070000B3397,,,40,,,,,,,,,,1,,,,,,,,,,6.345666,46.071311
2023-964901,2023-01-04,000001,Vente en l'état futur d'achèvement,369707,,,RUE DE PIERRE LONGUE,0206,74800,74007,Amancy,74,,,740070000B3397,,,25,,,,,,,,,,1,,,,,,,,,,6.345666,46.071311
2023-964974,2023-01-04,000001,Vente en l'état futur d'achèvement,362000,,,,,,74007,Amancy,74,,,740070000A2836,,,93,,,,,,,,,,1,,,,,,,,,,,
2023-964974,2023-01-04,000001,Vente en l'état futur d'achèvement,362000,,,,,,74007,Amancy,74,,,740070000A2836,,,57,,,,,,,,,,1,,,,,,,,,,,
2023-964974,2023-01-04,000001,Vente en l'état futur d'achèvement,362000,,,,,,74007,Amancy,74,,,740070000A2836,,,129,,,,,,,,,,1,,,,,,,,,,,
2023-965024,2023-01-03,000002,Vente,684000,384,,CHE DE LA FOUILLEUSE,0115,74800,74007,Amancy,74,,,740070000A2794,,,,,,,,,,,,,0,1,Maison,193,7,S,sols,,,1072,6.310384,46.076196
2023-965024,2023-01-03,000002,Vente,684000,,,FOUILLEUSE,B018,74800,74007,Amancy,74,,,740070000A2796,,,,,,,,,,,,,0,,,,,T,terres,,,313,6.310124,46.07622
2023-965108,2023-01-19,000001,Vente en l'état futur d'achèvement,293000,,,A VALLIERES,B035,74800,74007,Amancy,74,,,740070000B2786,,,18,,,,,,,,,,1,,,,,,,,,,6.322328,46.068312
2023-965108,2023-01-19,000001,Vente en l'état futur d'achèvement,293000,,,A VALLIERES,B035,74800,74007,Amancy,74,,,740070000B2786,,,73,,,,,,,,,,1,,,,,,,,,,6.322328,46.068312
2023-965109,2023-01-20,000001,Vente en l'état futur d'achèvement,209000,,,A VALLIERES,B035,74800,74007,Amancy,74,,,740070000B2786,,,51,,,,,,,,,,1,,,,,,,,,,6.322328,46.068312
2023-965109,2023-01-20,000001,Vente en l'état futur d'achèvement,209000,,,A VALLIERES,B035,74800,74007,Amancy,74,,,740070000B2786,,,90,,,,,,,,,,1,,,,,,,,,,6.322328,46.068312
2023-965109,2023-01-20,000001,Vente en l'état futur d'achèvement,209000,,,A VALLIERES,B035,74800,74007,Amancy,74,,,740070000B2786,,,7,,,,,,,,,,1,,,,,,,,,,6.322328,46.068312
2023-965561,2023-01-20,000001,Vente,420000,,,LA TOURNELETTE,B032,74800,74007,Amancy,74,,,740070000B2217,,,,,,,,,,,,,0,,,,,T,terres,,,1516,6.330162,46.064126
2023-965561,2023-01-20,000001,Vente,420000,851,,RTE DE LA TOURNELETTE,0274,74800,74007,Amancy,74,,,740070000B2218,,,,,,,,,,,,,0,3,Dépendance,,0,S,sols,,,1000,6.330158,46.063705
2023-965561,2023-01-20,000001,Vente,420000,851,,RTE DE LA TOURNELETTE,0274,74800,74007,Amancy,74,,,740070000B2218,,,,,,,,,,,,,0,1,Maison,120,5,S,sols,,,1000,6.330158,46.063705
2023-965561,2023-01-20,000001,Vente,420000,851,,RTE DE LA TOURNELETTE,0274,74800,74007,Amancy,74,,,740070000B2218,,,,,,,,,,,,,0,3,Dépendance,,0,S,sols,,,1000,6.330158,46.063705
2023-965561,2023-01-20,000001,Vente,420000,851,,RTE DE LA TOURNELETTE,0274,74800,74007,Amancy,74,,,740070000B2218,,,,,,,,,,,,,0,3,Dépendance,,0,T,terres,,,920,6.330158,46.063705
2023-965561,2023-01-20,000001,Vente,420000,851,,RTE DE LA TOURNELETTE,0274,74800,74007,Amancy,74,,,740070000B2218,,,,,,,,,,,,,0,1,Maison,120,5,T,terres,,,920,6.330158,46.063705
2023-965561,2023-01-20,000001,Vente,420000,851,,RTE DE LA TOURNELETTE,0274,74800,74007,Amancy,74,,,740070000B2218,,,,,,,,,,,,,0,3,Dépendance,,0,T,terres,,,920,6.330158,46.063705
2023-965678,2023-02-06,000001,Vente en l'état futur d'achèvement,301090,,,RUE DE PIERRE LONGUE,0206,74800,74007,Amancy,74,,,740070000B3397,,,29,,,,,,,,,,1,,,,,,,,,,6.345666,46.071311
2023-965678,2023-02-06,000001,Vente en l'état futur d'achèvement,301090,,,RUE DE PIERRE LONGUE,0206,74800,74007,Amancy,74,,,740070000B3397,,,9,,,,,,,,,,1,,,,,,,,,,6.345666,46.071311
2023-965678,2023-02-06,000001,Vente en l'état futur d'achèvement,301090,,,RUE DE PIERRE LONGUE,0206,74800,74007,Amancy,74,,,740070000B3397,,,36,,,,,,,,,,1,,,,,,,,,,6.345666,46.071311
2023-965709,2023-02-03,000001,Vente,519500,209,,RUE DE LA PLAINE,0208,74800,74007,Amancy,74,,,740070000B2969,,,,,,,,,,,,,0,1,Maison,114,3,S,sols,,,806,6.334779,46.071473
2023-965886,2023-02-02,000001,Vente,283050,1330,,RTE DE BONNEVILLE,0008,74800,74007,Amancy,74,,,740070000B1883,,,,,,,,,,,,,0,1,Maison,120,7,S,sols,,,308,6.329478,46.071209
2023-965886,2023-02-02,000001,Vente,283050,1332,,RTE DE BONNEVILLE,0008,74800,74007,Amancy,74,,,740070000B1884,,,1,,,,,,,,,,1,3,Dépendance,,0,,,,,,6.329738,46.071261
2023-965993,2023-02-15,000001,Vente,4470,,,LE QUARRE,B027,74800,74007,Amancy,74,,,740070000A2411,,,,,,,,,,,,,0,,,,,T,terres,,,2980,6.317487,46.075012
2023-966108,2023-02-23,000001,Vente,260000,276,,RUE DE PIERRE LONGUE,0206,74800,74007,Amancy,74,,,740070000B2932,,,4,204,,,,,,,,,1,4,Local industriel. commercial ou assimilé,204,0,,,,,,6.347648,46.072287
2023-966415,2023-02-28,000001,Vente,710000,375,,RUE DE LA FONTAINE,0104,74800,74007,Amancy,74,,,740070000B2038,,,,,,,,,,,,,0,1,Maison,208,6,S,sols,,,1163,6.3329,46.071823
2023-966415,2023-02-28,000001,Vente,710000,,,LES TRANCHEES,B033,74800,74007,Amancy,74,,,740070000B2040,,,,,,,,,,,,,0,,,,,T,terres,,,146,6.332986,46.071696
2023-966530,2023-02-22,000001,Vente en l'état futur d'achèvement,211000,,,A VALLIERES,B035,74800,74007,Amancy,74,,,740070000B2786,,,15,,,,,,,,,,1,,,,,,,,,,6.322328,46.068312
2023-966530,2023-02-22,000001,Vente en l'état futur d'achèvement,211000,,,A VALLIERES,B035,74800,74007,Amancy,74,,,740070000B2786,,,118,,,,,,,,,,1,,,,,,,,,,6.322328,46.068312
2023-966530,2023-02-22,000001,Vente en l'état futur d'achèvement,211000,,,A VALLIERES,B035,74800,74007,Amancy,74,,,740070000B2786,,,70,,,,,,,,,,1,,,,,,,,,,6.322328,46.068312
2023-966856,2023-03-10,000001,Vente,194000,320,,RUE DE LA FONTAINE,0104,74800,74007,Amancy,74,,,740070000A1516,,,3,43.71,,,,,,,,,1,2,Appartement,43,2,,,,,,6.331824,46.071757
2023-966856,2023-03-10,000001,Vente,194000,320,,RUE DE LA FONTAINE,0104,74800,74007,Amancy,74,,,740070000A1516,,,24,,,,,,,,,,1,3,Dépendance,,0,,,,,,6.331824,46.071757
2023-966876,2023-02-28,000001,Vente,311860,1051,,RUE DE LA PLAINE,0208,74800,74007,Amancy,74,,,740070000B3262,,,18,,,,,,,,,,1,3,Dépendance,,0,,,,,,6.344541,46.070812
2023-966876,2023-02-28,000001,Vente,311860,1051,,RUE DE LA PLAINE,0208,74800,74007,Amancy,74,,,740070000B3262,,,3,77.1,,,,,,,,,1,2,Appartement,76,4,,,,,,6.344541,46.070812
2023-966998,2023-03-16,000001,Vente,635000,276,,RUE DE PIERRE LONGUE,0206,74800,74007,Amancy,74,,,740070000B2932,,,2,209.3,,,,,,,,,1,4,Local industriel. commercial ou assimilé,188,0,,,,,,6.347648,46.072287
2023-966998,2023-03-16,000001,Vente,635000,276,,RUE DE PIERRE LONGUE,0206,74800,74007,Amancy,74,,,740070000B2932,,,1,368.1,,,,,,,,,1,4,Local industriel. commercial ou assimilé,368,0,,,,,,6.347648,46.072287
2023-967163,2023-03-08,000001,Vente en l'état futur d'achèvement,214000,,,A VALLIERES,B035,74800,74007,Amancy,74,,,740070000B2786,,,76,,,,,,,,,,1,,,,,,,,,,6.322328,46.068312
2023-967163,2023-03-08,000001,Vente en l'état futur d'achèvement,214000,,,A VALLIERES,B035,74800,74007,Amancy,74,,,740070000B2786,,,21,,,,,,,,,,1,,,,,,,,,,6.322328,46.068312
2023-967163,2023-03-08,000001,Vente en l'état futur d'achèvement,214000,,,A VALLIERES,B035,74800,74007,Amancy,74,,,740070000B2786,,,109,,,,,,,,,,1,,,,,,,,,,6.322328,46.068312
2023-967165,2023-03-09,000001,Vente en l'état futur d'achèvement,217000,,,A VALLIERES,B035,74800,74007,Amancy,74,,,740070000B2786,,,103,,,,,,,,,,1,,,,,,,,,,6.322328,46.068312
2023-967165,2023-03-09,000001,Vente en l'état futur d'achèvement,217000,,,A VALLIERES,B035,74800,74007,Amancy,74,,,740070000B2786,,,40,,,,,,,,,,1,,,,,,,,,,6.322328,46.068312
2023-967165,2023-03-09,000001,Vente en l'état futur d'achèvement,217000,,,A VALLIERES,B035,74800,74007,Amancy,74,,,740070000B2786,,,63,,,,,,,,,,1,,,,,,,,,,6.322328,46.068312
2023-967198,2023-03-16,000001,Vente en l'état futur d'achèvement,371000,,,A VALLIERES,B035,74800,74007,Amancy,74,,,740070000B2786,,,110,,,,,,,,,,1,,,,,,,,,,6.322328,46.068312
2023-967198,2023-03-16,000001,Vente en l'état futur d'achèvement,371000,,,A VALLIERES,B035,74800,74007,Amancy,74,,,740070000B2786,,,20,,,,,,,,,,1,,,,,,,,,,6.322328,46.068312
2023-967198,2023-03-16,000001,Vente en l'état futur d'achèvement,371000,,,A VALLIERES,B035,74800,74007,Amancy,74,,,740070000B2786,,,75,,,,,,,,,,1,,,,,,,,,,6.322328,46.068312
2023-967282,2023-03-29,000001,Vente,569400,56,,ALL DES MESANGES,0174,74800,74007,Amancy,74,,,740070000A2089,,,,,,,,,,,,,0,1,Maison,190,5,S,sols,,,1075,6.331052,46.086445
2023-967282,2023-03-29,000001,Vente,569400,63,,ALL DES MESANGES,0174,74800,74007,Amancy,74,,,740070000A2092,,,,,,,,,,,,,0,,,,,T,terres,,,466,6.331277,46.086154
2023-967305,2023-03-17,000001,Vente,310550,965,,RUE DE LA PLAINE,0208,74800,74007,Amancy,74,,,740070000B3033,,,52,,,,,,,,,,1,3,Dépendance,,0,,,,,,6.343119,46.070882
2023-967305,2023-03-17,000001,Vente,310550,1001,,RUE DE LA PLAINE,0208,74800,74007,Amancy,74,,,740070000B3033,,,40,76.45,88,,,,,,,,2,2,Appartement,76,4,,,,,,6.343119,46.070882
2023-967305,2023-03-17,000001,Vente,310550,1001,,RUE DE LA PLAINE,0208,74800,74007,Amancy,74,,,740070000B3033,,,40,76.45,88,,,,,,,,2,3,Dépendance,,0,,,,,,6.343119,46.070882
2023-967544,2023-03-29,000001,Vente,749880,,,PIERRE LONGUE,B026,74800,74007,Amancy,74,,,740070000B1104,,,,,,,,,,,,,0,,,,,T,terres,,,9215,6.346735,46.072317
2023-967544,2023-03-29,000001,Vente,749880,,,PIERRE LONGUE,B026,74800,74007,Amancy,74,,,740070000B1105,,,,,,,,,,,,,0,,,,,T,terres,,,3283,6.346269,46.071758
2023-967560,2023-03-20,000001,Vente,443350,1200,,RUE DE LA PLAINE,0208,74800,74007,Amancy,74,,,740070000B2646,,,,,,,,,,,,,0,3,Dépendance,,0,S,sols,,,1184,6.346037,46.070891
2023-967560,2023-03-20,000001,Vente,443350,1200,,RUE DE LA PLAINE,0208,74800,74007,Amancy,74,,,740070000B2646,,,,,,,,,,,,,0,1,Maison,85,4,S,sols,,,1184,6.346037,46.070891
2023-967591,2023-03-10,000001,Vente,485000,890,,RUE DE LA PLAINE,0208,74800,74007,Amancy,74,,,740070000B3106,,,,,,,,,,,,,0,1,Maison,112,4,S,sols,,,545,6.342899,46.070333
2023-967591,2023-03-10,000001,Vente,485000,,,RUE DE LA PLAINE,0208,74800,74007,Amancy,74,,,740070000B3107,,,,,,,,,,,,,0,,,,,S,sols,,,59,6.342712,46.070383
2023-967691,2023-03-29,000001,Vente en l'état futur d'achèvement,16000,40,,IMP AMARENTHES,0005,74800,74007,Amancy,74,,,740070000A2680,,,146,,,,,,,,,,1,3,Dépendance,,0,,,,,,6.326595,46.074909
2023-967691,2023-03-29,000001,Vente en l'état futur d'achèvement,16000,40,,IMP AMARENTHES,0005,74800,74007,Amancy,74,,,740070000A2680,,,145,,,,,,,,,,1,3,Dépendance,,0,,,,,,6.326595,46.074909
2023-967865,2023-03-16,000001,Vente,430820,1225,,RTE DES PAQUIS,0196,74800,74007,Amancy,74,,,740070000B3142,,,11,,,,,,,,,,1,3,Dépendance,,0,,,,,,6.339895,46.078196
2023-967865,2023-03-16,000001,Vente,430820,1227,,RTE DES PAQUIS,0196,74800,74007,Amancy,74,,,740070000B3142,,,14,93.57,,,,,,,,,1,2,Appartement,104,5,,,,,,6.339895,46.078196
2023-967865,2023-03-16,000001,Vente,430820,1225,,RTE DES PAQUIS,0196,74800,74007,Amancy,74,,,740070000B3142,,,11,,,,,,,,,,1,3,Dépendance,,0,,,,,,6.339895,46.078196
2023-967983,2023-04-13,000001,Vente en l'état futur d'achèvement,209000,,,A VALLIERES,B035,74800,74007,Amancy,74,,,740070000B2786,,,58,,,,,,,,,,1,,,,,,,,,,6.322328,46.068312
2023-967983,2023-04-13,000001,Vente en l'état futur d'achèvement,209000,,,A VALLIERES,B035,74800,74007,Amancy,74,,,740070000B2786,,,99,,,,,,,,,,1,,,,,,,,,,6.322328,46.068312
2023-967983,2023-04-13,000001,Vente en l'état futur d'achèvement,209000,,,A VALLIERES,B035,74800,74007,Amancy,74,,,740070000B2786,,,36,,,,,,,,,,1,,,,,,,,,,6.322328,46.068312
2023-968057,2023-04-05,000001,Vente,100100,,,VOZERIER SUD,B044,74800,74007,Amancy,74,,,740070000B0270,,,,,,,,,,,,,0,,,,,T,terres,,,770,6.33837,46.067867
2023-968126,2023-04-19,000002,Vente,2160,,,RTE DE SAINT PIERRE,0235,74800,74007,Amancy,74,,,740070000B3275,,,,,,,,,,,,,0,,,,,S,sols,,,48,6.34462,46.065834
2023-968336,2023-04-05,000001,Vente,17000,965,,RUE DE LA PLAINE,0208,74800,74007,Amancy,74,,,740070000B3033,,,43,,,,,,,,,,1,3,Dépendance,,0,,,,,,6.343119,46.070882
2023-968481,2023-04-28,000001,Vente en l'état futur d'achèvement,197000,,,A VALLIERES,B035,74800,74007,Amancy,74,,,740070000B2786,,,81,,,,,,,,,,1,,,,,,,,,,6.322328,46.068312
2023-968481,2023-04-28,000001,Vente en l'état futur d'achèvement,197000,,,A VALLIERES,B035,74800,74007,Amancy,74,,,740070000B2786,,,26,,,,,,,,,,1,,,,,,,,,,6.322328,46.068312
2023-968524,2023-04-11,000001,Vente terrain à bâtir,22565,,,LA VERNAZ EST,B038,74800,74007,Amancy,74,,,740070000A0484,,,,,,,,,,,,,0,,,,,BT,taillis simples,,,100,6.313809,46.077544
2023-968524,2023-04-11,000001,Vente terrain à bâtir,22565,,,LA VERNAZ EST,B038,74800,74007,Amancy,74,,,740070000A0485,,,,,,,,,,,,,0,,,,,BT,taillis simples,,,700,6.313636,46.077423
2023-968524,2023-04-11,000001,Vente terrain à bâtir,22565,,,LA VERNAZ EST,B038,74800,74007,Amancy,74,,,740070000A0486,,,,,,,,,,,,,0,,,,,T,terres,,,10788,6.313817,46.078215
2023-968524,2023-04-11,000001,Vente terrain à bâtir,22565,,,FOUILLEUSE,B018,74800,74007,Amancy,74,,,740070000A0540,,,,,,,,,,,,,0,,,,,T,terres,,,3680,6.312115,46.078099
2023-968524,2023-04-11,000001,Vente terrain à bâtir,22565,,,FOUILLEUSE,B018,74800,74007,Amancy,74,,,740070000A0541,,,,,,,,,,,,,0,,,,,PP,prés plantes,,,5260,6.312691,46.077901
2023-968525,2023-04-11,000002,Vente terrain à bâtir,319,,,LA VERNAZ EST,B038,74800,74007,Amancy,74,,,740070000A2031,,,,,,,,,,,,,0,,,,,T,terres,,,721,6.313346,46.078984
2023-968525,2023-04-11,000002,Vente terrain à bâtir,319,,,LA VERNAZ EST,B038,74800,74007,Amancy,74,,,740070000A2033,,,,,,,,,,,,,0,,,,,P,prés,,,235,6.313625,46.078704
2023-968569,2023-04-28,000001,Vente,29395.5,,,LE QUARRE,B027,74800,74007,Amancy,74,,,740070000A0580,,,,,,,,,,,,,0,,,,,T,terres,,,3944,6.316472,46.076693
2023-968569,2023-04-28,000001,Vente,29395.5,,,LA VERNAZ EST,B038,74800,74007,Amancy,74,,,740070000A2032,,,,,,,,,,,,,0,,,,,T,terres,,,15653,6.313611,46.079096
2023-968619,2023-04-26,000001,Vente,354000,29,,RUE DU CHATEAU,0059,74800,74007,Amancy,74,,,740070000A2556,,,5,,,,,,,,,,1,3,Dépendance,,0,,,,,,6.319734,46.079967
2023-968619,2023-04-26,000001,Vente,354000,29,,RUE DU CHATEAU,0059,74800,74007,Amancy,74,,,740070000A2556,,,8,71.46,,,,,,,,,1,2,Appartement,71,3,,,,,,6.319734,46.079967
2023-968664,2023-05-05,000001,Vente,250000,178,,LOT LES NEJOUAZ,A008,74800,74007,Amancy,74,,,740070000B1584,,,,,,,,,,,,,0,1,Maison,94,5,S,sols,,,1600,6.330842,46.070158
2023-968664,2023-05-05,000001,Vente,250000,178,,LOT LES NEJOUAZ,A008,74800,74007,Amancy,74,,,740070000B1584,,,,,,,,,,,,,0,3,Dépendance,,0,S,sols,,,1600,6.330842,46.070158
2023-968664,2023-05-05,000001,Vente,250000,178,,LOT LES NEJOUAZ,A008,74800,74007,Amancy,74,,,740070000B1584,,,,,,,,,,,,,0,3,Dépendance,,0,S,sols,,,1600,6.330842,46.070158
2023-969214,2023-05-10,000001,Vente,782500,260,,RTE DE LA VULPILIERE,0321,74800,74007,Amancy,74,,,740070000A1457,,,,,,,,,,,,,0,1,Maison,105,5,S,sols,,,1000,6.324038,46.073447
2023-969214,2023-05-10,000001,Vente,782500,260,,RTE DE LA VULPILIERE,0321,74800,74007,Amancy,74,,,740070000A1457,,,,,,,,,,,,,0,3,Dépendance,,0,S,sols,,,1000,6.324038,46.073447
2023-969214,2023-05-10,000001,Vente,782500,260,,RTE DE LA VULPILIERE,0321,74800,74007,Amancy,74,,,740070000A1457,,,,,,,,,,,,,0,3,Dépendance,,0,T,terres,,,1055,6.324038,46.073447
2023-969214,2023-05-10,000001,Vente,782500,260,,RTE DE LA VULPILIERE,0321,74800,74007,Amancy,74,,,740070000A1457,,,,,,,,,,,,,0,1,Maison,105,5,T,terres,,,1055,6.324038,46.073447
2023-969214,2023-05-10,000001,Vente,782500,,,LES TRANCHEES,B033,74800,74007,Amancy,74,,,740070000B2870,,,,,,,,,,,,,0,,,,,T,terres,,,1191,6.33511,46.071433
2023-969214,2023-05-10,000001,Vente,782500,,,LES TRANCHEES,B033,74800,74007,Amancy,74,,,740070000B2871,,,,,,,,,,,,,0,,,,,PP,prés plantes,,,15,6.334962,46.071247
2023-969214,2023-05-10,000001,Vente,782500,,,LES TRANCHEES,B033,74800,74007,Amancy,74,,,740070000B2899,,,,,,,,,,,,,0,,,,,PP,prés plantes,,,14,6.335125,46.071151
2023-969214,2023-05-10,000001,Vente,782500,,,LES TRANCHEES,B033,74800,74007,Amancy,74,,,740070000B2901,,,,,,,,,,,,,0,,,,,T,terres,,,480,6.335328,46.071351
2023-969299,2023-05-31,000001,Vente,355300,141,,IMP DES ALYSSES,0002,74800,74007,Amancy,74,,,740070000B2776,,,,,,,,,,,,,0,1,Maison,94,5,S,sols,,,150,6.321335,46.069198
2023-969307,2023-05-19,000001,Vente en l'état futur d'achèvement,305000,,,A VALLIERES,B035,74800,74007,Amancy,74,,,740070000B2786,,,126,,,,,,,,,,1,,,,,,,,,,6.322328,46.068312
2023-969307,2023-05-19,000001,Vente en l'état futur d'achèvement,305000,,,A VALLIERES,B035,74800,74007,Amancy,74,,,740070000B2786,,,84,,,,,,,,,,1,,,,,,,,,,6.322328,46.068312
2023-969307,2023-05-19,000001,Vente en l'état futur d'achèvement,305000,,,A VALLIERES,B035,74800,74007,Amancy,74,,,740070000B2786,,,29,,,,,,,,,,1,,,,,,,,,,6.322328,46.068312
2023-969685,2023-06-09,000001,Vente en l'état futur d'achèvement,370900,,,RUE DE PIERRE LONGUE,0206,74800,74007,Amancy,74,,,740070000B3397,,,4,,,,,,,,,,1,,,,,,,,,,6.345666,46.071311
2023-969685,2023-06-09,000001,Vente en l'état futur d'achèvement,370900,,,RUE DE PIERRE LONGUE,0206,74800,74007,Amancy,74,,,740070000B3397,,,20,,,,,,,,,,1,,,,,,,,,,6.345666,46.071311
2023-969685,2023-06-09,000001,Vente en l'état futur d'achèvement,370900,,,RUE DE PIERRE LONGUE,0206,74800,74007,Amancy,74,,,740070000B3397,,,45,,,,,,,,,,1,,,,,,,,,,6.345666,46.071311
2023-969936,2023-06-06,000001,Vente,410650,1225,,RTE DES PAQUIS,0196,74800,74007,Amancy,74,,,740070000B3142,,,3,,,,,,,,,,1,3,Dépendance,,0,,,,,,6.339895,46.078196
2023-969936,2023-06-06,000001,Vente,410650,1225,,RTE DES PAQUIS,0196,74800,74007,Amancy,74,,,740070000B3142,,,6,85.89,,,,,,,,,1,2,Appartement,86,4,,,,,,6.339895,46.078196
2023-969971,2023-06-13,000001,Vente en l'état futur d'achèvement,356000,,,RUE DE PIERRE LONGUE,0206,74800,74007,Amancy,74,,,740070000B3397,,,43,,,,,,,,,,1,,,,,,,,,,6.345666,46.071311
2023-969971,2023-06-13,000001,Vente en l'état futur d'achèvement,356000,,,RUE DE PIERRE LONGUE,0206,74800,74007,Amancy,74,,,740070000B3397,,,22,,,,,,,,,,1,,,,,,,,,,6.345666,46.071311
2023-969971,2023-06-13,000001,Vente en l'état futur d'achèvement,356000,,,RUE DE PIERRE LONGUE,0206,74800,74007,Amancy,74,,,740070000B3397,,,14,,,,,,,,,,1,,,,,,,,,,6.345666,46.071311
2023-969983,2023-06-12,000001,Vente en l'état futur d'achèvement,364000,,,,,,74007,Amancy,74,,,740070000A2836,,,70,,,,,,,,,,1,,,,,,,,,,,
2023-969983,2023-06-12,000001,Vente en l'état futur d'achèvement,364000,,,,,,74007,Amancy,74,,,740070000A2836,,,124,81.05,,,,,,,,,1,,,,,,,,,,,
2023-969983,2023-06-12,000001,Vente en l'état futur d'achèvement,364000,,,,,,74007,Amancy,74,,,740070000A2836,,,44,,,,,,,,,,1,,,,,,,,,,,
2023-969983,2023-06-12,000001,Vente en l'état futur d'achèvement,364000,,,,,,74007,Amancy,74,,,740070000A2836,,,91,,,,,,,,,,1,,,,,,,,,,,
2023-970835,2023-07-07,000001,Vente en l'état futur d'achèvement,221000,,,A VALLIERES,B035,74800,74007,Amancy,74,,,740070000B2786,,,42,,,,,,,,,,1,,,,,,,,,,6.322328,46.068312
2023-970835,2023-07-07,000001,Vente en l'état futur d'achèvement,221000,,,A VALLIERES,B035,74800,74007,Amancy,74,,,740070000B2786,,,130,,,,,,,,,,1,,,,,,,,,,6.322328,46.068312
2023-970835,2023-07-07,000001,Vente en l'état futur d'achèvement,221000,,,A VALLIERES,B035,74800,74007,Amancy,74,,,740070000B2786,,,64,,,,,,,,,,1,,,,,,,,,,6.322328,46.068312
2023-971350,2023-04-06,000001,Adjudication,185000,440,,RUE DES PRES,0212,74800,74007,Amancy,74,,,740070000B2174,,,,,,,,,,,,,0,2,Appartement,101,3,S,sols,,,340,6.34298,46.066683
2023-971350,2023-04-06,000001,Adjudication,185000,440,,RUE DES PRES,0212,74800,74007,Amancy,74,,,740070000B2174,,,,,,,,,,,,,0,3,Dépendance,,0,S,sols,,,340,6.34298,46.066683
2023-971350,2023-04-06,000001,Adjudication,185000,440,,RUE DES PRES,0212,74800,74007,Amancy,74,,,740070000B2174,,,,,,,,,,,,,0,2,Appartement,67,2,S,sols,,,340,6.34298,46.066683
2023-971443,2023-07-11,000001,Vente en l'état futur d'achèvement,5000,,,,,,74007,Amancy,74,,,740070000A2836,,,39,,,,,,,,,,1,,,,,,,,,,,
2023-971663,2023-07-28,000001,Vente en l'état futur d'achèvement,366000,,,A VALLIERES,B035,74800,74007,Amancy,74,,,740070000B2786,,,62,,,,,,,,,,1,,,,,,,,,,6.322328,46.068312
2023-971663,2023-07-28,000001,Vente en l'état futur d'achèvement,366000,,,A VALLIERES,B035,74800,74007,Amancy,74,,,740070000B2786,,,39,,,,,,,,,,1,,,,,,,,,,6.322328,46.068312
2023-971663,2023-07-28,000001,Vente en l'état futur d'achèvement,366000,,,A VALLIERES,B035,74800,74007,Amancy,74,,,740070000B2786,,,128,,,,,,,,,,1,,,,,,,,,,6.322328,46.068312
2023-972087,2023-08-02,000001,Vente,320350,889,,RUE DE LA PLAINE,0208,74800,74007,Amancy,74,,,740070000B3033,,,15,83.43,,,,,,,,,1,2,Appartement,83,4,,,,,,6.343119,46.070882
2023-972087,2023-08-02,000001,Vente,320350,965,,RUE DE LA PLAINE,0208,74800,74007,Amancy,74,,,740070000B3033,,,72,,,,,,,,,,1,3,Dépendance,,0,,,,,,6.343119,46.070882
2023-972250,2023-08-03,000002,Vente,200000,276,,RUE DE PIERRE LONGUE,0206,74800,74007,Amancy,74,,,740070000B2932,,,10,,9,,,,,,,,2,4,Local industriel. commercial ou assimilé,335,0,,,,,,6.347648,46.072287
2023-972423,2023-08-03,000001,Vente,270000,965,,RUE DE LA PLAINE,0208,74800,74007,Amancy,74,,,740070000B3033,,,42,,,,,,,,,,1,3,Dépendance,,0,,,,,,6.343119,46.070882
2023-972423,2023-08-03,000001,Vente,270000,855,,RUE DE LA PLAINE,0208,74800,74007,Amancy,74,,,740070000B3033,,,6,71.25,,,,,,,,,1,2,Appartement,74,3,,,,,,6.343119,46.070882
2023-972619,2023-08-10,000001,Vente,366050,,,SOUS LA TOUR,B030,74800,74007,Amancy,74,,,740070000B0487,,,,,,,,,,,,,0,,,,,S,sols,,,158,6.341718,46.066968
2023-972619,2023-08-10,000001,Vente,366050,580,,RTE DE SAINT PIERRE,0235,74800,74007,Amancy,74,,,740070000B3212,,,,,,,,,,,,,0,2,Appartement,96,4,S,sols,,,68,6.341676,46.067049
2023-972619,2023-08-10,000001,Vente,366050,580,,RTE DE SAINT PIERRE,0235,74800,74007,Amancy,74,,,740070000B3212,,,,,,,,,,,,,0,3,Dépendance,,0,S,sols,,,68,6.341676,46.067049
2023-972619,2023-08-10,000001,Vente,366050,580,,RTE DE SAINT PIERRE,0235,74800,74007,Amancy,74,,,740070000B3212,,,,,,,,,,,,,0,3,Dépendance,,0,S,sols,,,68,6.341676,46.067049
2023-972619,2023-08-10,000001,Vente,366050,,,RTE DE SAINT PIERRE,0235,74800,74007,Amancy,74,,,740070000B3213,,,,,,,,,,,,,0,,,,,S,sols,,,182,6.341532,46.066885
2023-972809,2023-08-30,000001,Vente,310000,126,,RTE DE THONON,0262,74800,74007,Amancy,74,,,740070000A2368,,,1,115.81,3,,,,,,,,2,2,Appartement,85,4,,,,,,6.31348,46.075669
2023-972809,2023-08-30,000001,Vente,310000,126,,RTE DE THONON,0262,74800,74007,Amancy,74,,,740070000A2368,,,3,,,,,,,,,,1,3,Dépendance,,0,,,,,,6.31348,46.075669
2023-972821,2023-09-05,000001,Vente en l'état futur d'achèvement,251000,,,,,,74007,Amancy,74,,,740070000A2836,,,107,,,,,,,,,,1,,,,,,,,,,,
2023-972821,2023-09-05,000001,Vente en l'état futur d'achèvement,251000,,,,,,74007,Amancy,74,,,740070000A2836,,,141,44.4,,,,,,,,,1,,,,,,,,,,,
2023-972821,2023-09-05,000001,Vente en l'état futur d'achèvement,251000,,,,,,74007,Amancy,74,,,740070000A2836,,,74,,,,,,,,,,1,,,,,,,,,,,
2023-972828,2023-08-31,000001,Vente en l'état futur d'achèvement,1701002.9,,,,,,74007,Amancy,74,,,740070000A2836,,,48,,,,,,,,,,1,,,,,,,,,,,
2023-972828,2023-08-31,000001,Vente en l'état futur d'achèvement,1701002.9,,,,,,74007,Amancy,74,,,740070000A2836,,,51,,,,,,,,,,1,,,,,,,,,,,
2023-972828,2023-08-31,000001,Vente en l'état futur d'achèvement,1701002.9,,,,,,74007,Amancy,74,,,740070000A2836,,,49,,,,,,,,,,1,,,,,,,,,,,