id_mutation,date_mutation,numero_disposition,nature_mutation,valeur_fonciere,adresse_numero,adresse_suffixe,adresse_nom_voie,adresse_code_voie,code_postal,code_commune,nom_commune,code_departement,ancien_code_commune,ancien_nom_commune,id_parcelle,ancien_id_parcelle,numero_volume,lot1_numero,lot1_surface_carrez,lot2_numero,lot2_surface_carrez,lot3_numero,lot3_surface_carrez,lot4_numero,lot4_surface_carrez,lot5_numero,lot5_surface_carrez,nombre_lots,code_type_local,type_local,surface_reelle_bati,nombre_pieces_principales,code_nature_culture,nature_culture,code_nature_culture_speciale,nature_culture_speciale,surface_terrain,longitude,latitude
2023-954451,2023-01-11,000001,Vente,1300,,,BEAU SEJOUR,B006,74150,74192,Moye,74,,,741920000A0965,,,,,,,,,,,,,0,,,,,P,prés,,,1200,5.896388,45.895892
2023-954451,2023-01-11,000001,Vente,1300,,,BEAU SEJOUR,B006,74150,74192,Moye,74,,,741920000A0985,,,,,,,,,,,,,0,,,,,P,prés,,,150,5.89659,45.895931
2023-957124,2023-04-12,000001,Vente,438220,,,BISE ET CHAVANEL,B013,74150,74192,Moye,74,,,741920000A0154,,,,,,,,,,,,,0,,,,,P,prés,,,748,5.888455,45.891305
2023-957124,2023-04-12,000001,Vente,438220,6048,,RTE DU CLERGEON,0230,74150,74192,Moye,74,,,741920000A1182,,,,,,,,,,,,,0,1,Maison,100,5,P,prés,,,760,5.888841,45.891055
2023-957124,2023-04-12,000001,Vente,438220,6048,,RTE DU CLERGEON,0230,74150,74192,Moye,74,,,741920000A1182,,,,,,,,,,,,,0,1,Maison,100,5,S,sols,,,1070,5.888841,45.891055
2023-958035,2023-05-10,000001,Vente,417550,2185,,RTE DU CLERGEON,0230,74150,74192,Moye,74,,,741920000B1163,,,,,,,,,,,,,0,1,Maison,80,4,S,sols,,,1032,5.909561,45.879
2023-958482,2023-05-12,000001,Vente,207.6,,,SOUS LES GEAIS,B144,74150,74192,Moye,74,,,741920000D0989,,,,,,,,,,,,,0,,,,,P,prés,,,1038,5.891979,45.845247
2023-958794,2023-05-22,000001,Vente,395000,,,POISU,B117,74150,74192,Moye,74,,,741920000B0767,,,,,,,,,,,,,0,,,,,L,landes,,,423,5.909278,45.868034
2023-958794,2023-05-22,000001,Vente,395000,102,,IMP DU QUARRES,0640,74150,74192,Moye,74,,,741920000B1451,,,,,,,,,,,,,0,1,Maison,115,5,S,sols,,,281,5.909524,45.867817
2023-958794,2023-05-22,000001,Vente,395000,,,POISU,B117,74150,74192,Moye,74,,,741920000B1452,,,,,,,,,,,,,0,,,,,S,sols,,,129,5.909708,45.867855
2023-958794,2023-05-22,000001,Vente,395000,,,POISU,B117,74150,74192,Moye,74,,,741920000B1453,,,,,,,,,,,,,0,,,,,P,prés,,,384,5.909193,45.867836
2023-958794,2023-05-22,000001,Vente,395000,,,POISU,B117,74150,74192,Moye,74,,,741920000B1456,,,,,,,,,,,,,0,,,,,P,prés,,,62,5.909427,45.867759
2023-958794,2023-05-22,000001,Vente,395000,,,POISU,B117,74150,74192,Moye,74,,,741920000B1462,,,,,,,,,,,,,0,,,,,P,prés,,,142,5.909348,45.86788
2023-960110,2023-06-29,000001,Vente,185000,1366,,RTE DE LIENNET,0410,74150,74192,Moye,74,,,741920000B1548,,,,,,,,,,,,,0,1,Maison,24,1,S,sols,,,732,5.910816,45.892176
2023-960110,2023-06-29,000001,Vente,185000,,,LA BAULAZ,B004,74150,74192,Moye,74,,,741920000B1551,,,,,,,,,,,,,0,,,,,T,terres,,,45,5.910965,45.891604
2023-960729,2023-07-13,000001,Vente,152.6,,,BELLE COMBE,B007,74150,74192,Moye,74,,,741920000D1173,,,,,,,,,,,,,0,,,,,P,prés,,,436,5.907374,45.841404
2023-960833,2023-08-01,000001,Vente,363620,,,LA RATE,B127,74150,74192,Moye,74,,,741920000D1472,,,,,,,,,,,,,0,,,,,S,sols,,,238,5.91355,45.858552
2023-960833,2023-08-01,000001,Vente,363620,50,,IMP DE MALLET,0450,74150,74192,Moye,74,,,741920000D1529,,,,,,,,,,,,,0,1,Maison,73,4,S,sols,,,981,5.913584,45.858673
2023-960833,2023-08-01,000001,Vente,363620,,,LA RATE,B127,74150,74192,Moye,74,,,741920000D1530,,,,,,,,,,,,,0,,,,,S,sols,,,21,5.913423,45.858689
2023-961379,2023-07-27,000001,Vente,402450,,,POISU,B117,74150,74192,Moye,74,,,741920000B1482,,,,,,,,,,,,,0,,,,,S,sols,,,18,5.911085,45.868408
2023-961379,2023-07-27,000001,Vente,402450,442,,RTE DU POISU,0600,74150,74192,Moye,74,,,741920000B1484,,,,,,,,,,,,,0,1,Maison,105,6,S,sols,,,228,5.911055,45.868372
2023-962430,2023-09-15,000001,Vente,1200,,,VERS LE MONT,B156,74150,74192,Moye,74,,,741920000A0195,,,,,,,,,,,,,0,,,,,BS,taillis sous futaie,,,2080,5.883674,45.894955
2023-962430,2023-09-15,000001,Vente,1200,,,LES MARAIS,B098,74150,74192,Moye,74,,,741920000A0473,,,,,,,,,,,,,0,,,,,P,prés,,,666,5.894636,45.888614
2023-962430,2023-09-15,000001,Vente,1200,,,LES MARAIS,B098,74150,74192,Moye,74,,,741920000A0474,,,,,,,,,,,,,0,,,,,P,prés,,,726,5.894375,45.888658
2023-962513,2023-09-18,000001,Vente,868,,,CRET NIVELLARD,B068,74150,74192,Moye,74,,,741920000A0457,,,,,,,,,,,,,0,,,,,T,terres,,,1240,5.896198,45.89122
2023-964494,2023-12-19,000001,Vente,150000,,,VIGNES DE SAINT JEAN,B159,74150,74192,Moye,74,,,741920000A0604,,,,,,,,,,,,,0,,,,,P,prés,,,410,5.898505,45.889208
2023-964494,2023-12-19,000001,Vente,150000,,,LES GRANDS CHAMPS,B087,74150,74192,Moye,74,,,741920000B0289,,,,,,,,,,,,,0,,,,,P,prés,,,1610,5.907706,45.883078
2023-964494,2023-12-19,000001,Vente,150000,2625,,RTE DU CLERGEON,0230,74150,74192,Moye,74,,,741920000B0290,,,,,,,,,,,,,0,1,Maison,45,2,S,sols,,,825,5.907299,45.882833
2023-964494,2023-12-19,000001,Vente,150000,,,LES GRANDS CHAMPS,B087,74150,74192,Moye,74,,,741920000B0291,,,,,,,,,,,,,0,,,,,P,prés,,,1780,5.906893,45.882503
2023-964494,2023-12-19,000001,Vente,150000,,,LES GRANDS CHAMPS,B087,74150,74192,Moye,74,,,741920000B0292,,,,,,,,,,,,,0,,,,,P,prés,,,720,5.907307,45.882297
2023-964494,2023-12-19,000001,Vente,150000,,,LE CHARVIN,B041,74150,74192,Moye,74,,,741920000C0995,,,,,,,,,,,,,0,,,,,P,prés,,,2600,5.883509,45.885009
