id_mutation,date_mutation,numero_disposition,nature_mutation,valeur_fonciere,adresse_numero,adresse_suffixe,adresse_nom_voie,adresse_code_voie,code_postal,code_commune,nom_commune,code_departement,ancien_code_commune,ancien_nom_commune,id_parcelle,ancien_id_parcelle,numero_volume,lot1_numero,lot1_surface_carrez,lot2_numero,lot2_surface_carrez,lot3_numero,lot3_surface_carrez,lot4_numero,lot4_surface_carrez,lot5_numero,lot5_surface_carrez,nombre_lots,code_type_local,type_local,surface_reelle_bati,nombre_pieces_principales,code_nature_culture,nature_culture,code_nature_culture_speciale,nature_culture_speciale,surface_terrain,longitude,latitude
2019-21,2019-01-04,000001,Vente,4000,9,Z,RUE GABRIEL VICAIRE,0080,01160,01304,Pont-d'Ain,01,,,01304000AN0244,,,45,,,,,,,,,,1,3,Dépendance,,0,,,,,,5.335657,46.043773
2019-33,2019-01-21,000001,Vente,62500,28,,RUE BERNARD GANGLOFF,0001,01160,01304,Pont-d'Ain,01,,,01304000AM0052,,,3,41.87,9,45.3,,,,,,,2,4,Local industriel. commercial ou assimilé,130,0,,,,,,5.337436,46.049495
2019-33,2019-01-21,000001,Vente,62500,28,,RUE BERNARD GANGLOFF,0001,01160,01304,Pont-d'Ain,01,,,01304000AM0052,,,11,,,,,,,,,,1,3,Dépendance,,0,,,,,,5.337436,46.049495
2019-58,2019-01-14,000001,Vente,36980,15,,RUE BERNARD GANGLOFF,0001,01160,01304,Pont-d'Ain,01,,,01304000AM0321,,,2,35.55,,,,,,,,,1,2,Appartement,29,2,,,,,,5.336926,46.048906
2019-77,2019-01-17,000001,Vente,156000,,,FAUBOURG D EN HAUT,B040,01160,01304,Pont-d'Ain,01,,,01304000AE0154,,,,,,,,,,,,,0,,,,,VI,vignes,,,405,5.347443,46.053998
2019-77,2019-01-17,000001,Vente,156000,10,,RTE DE GENEVE,0100,01160,01304,Pont-d'Ain,01,,,01304000AE0353,,,,,,,,,,,,,0,1,Maison,460,7,S,sols,,,578,5.3475,46.053797
2019-77,2019-01-17,000001,Vente,156000,,,FAUBOURG D EN HAUT,B040,01160,01304,Pont-d'Ain,01,,,01304000AE0355,,,,,,,,,,,,,0,,,,,J,jardins,,,20,5.347307,46.053862
2019-77,2019-01-17,000001,Vente,156000,,,FAUBOURG D EN HAUT,B040,01160,01304,Pont-d'Ain,01,,,01304000AE0356,,,,,,,,,,,,,0,,,,,J,jardins,,,340,5.347426,46.053874
2019-77,2019-01-17,000001,Vente,156000,,,FAUBOURG D EN HAUT,B040,01160,01304,Pont-d'Ain,01,,,01304000AE0359,,,,,,,,,,,,,0,,,,,S,sols,,,70,5.347661,46.05405
2019-106,2019-01-25,000001,Vente,255100,6112,,SUR MURET,B061,01160,01304,Pont-d'Ain,01,,,01304000ZA0213,,,,,,,,,,,,,0,1,Maison,162,7,S,sols,,,10,5.338158,46.07073
2019-106,2019-01-25,000001,Vente,255100,,,SUR MURET,B061,01160,01304,Pont-d'Ain,01,,,01304000ZA0214,,,,,,,,,,,,,0,,,,,S,sols,,,1000,5.338069,46.070961
2019-106,2019-01-25,000001,Vente,255100,,,SUR MURET,B061,01160,01304,Pont-d'Ain,01,,,01304000ZA0214,,,,,,,,,,,,,0,,,,,AG,terrains d'agrément,,,651,5.338069,46.070961
2019-106,2019-01-25,000001,Vente,255100,,,SUR MURET,B061,01160,01304,Pont-d'Ain,01,,,01304000ZA0216,,,,,,,,,,,,,0,,,,,AG,terrains d'agrément,,,137,5.338474,46.071185
2019-360,2019-02-11,000001,Vente,72000,,,OUSSIAT,B063,01160,01304,Pont-d'Ain,01,,,01304000AH0512,,,,,,,,,,,,,0,,,,,AB,terrains a bâtir,,,103,5.361871,46.056974
2019-360,2019-02-11,000001,Vente,72000,,,OUSSIAT,B063,01160,01304,Pont-d'Ain,01,,,01304000AH0515,,,,,,,,,,,,,0,,,,,AB,terrains a bâtir,,,272,5.361769,46.05711
2019-360,2019-02-11,000001,Vente,72000,,,OUSSIAT,B063,01160,01304,Pont-d'Ain,01,,,01304000AH0523,,,,,,,,,,,,,0,,,,,AB,terrains a bâtir,,,321,5.361839,46.057139
2019-360,2019-02-11,000001,Vente,72000,,,OUSSIAT,B063,01160,01304,Pont-d'Ain,01,,,01304000AH0527,,,,,,,,,,,,,0,,,,,AB,terrains a bâtir,,,5,5.361731,46.057227
2019-385,2019-02-12,000001,Vente,262975,5404,,NECUDEY,B062,01160,01304,Pont-d'Ain,01,,,013040000C0415,,,,,,,,,,,,,0,1,Maison,128,5,S,sols,,,833,5.332956,46.058005
2019-385,2019-02-12,000001,Vente,262975,5404,,NECUDEY,B062,01160,01304,Pont-d'Ain,01,,,013040000C0415,,,,,,,,,,,,,0,1,Maison,128,5,J,jardins,,,1280,5.332956,46.058005
2019-385,2019-02-12,000001,Vente,262975,,,NECUDEY,B062,01160,01304,Pont-d'Ain,01,,,013040000C0452,,,,,,,,,,,,,0,,,,,P,prés,,,121,5.333376,46.058151
2019-429,2019-02-22,000001,Vente,15250,,,OUSSIAT,B063,01160,01304,Pont-d'Ain,01,,,01304000AH0342,,,,,,,,,,,,,0,,,,,S,sols,,,47,5.360052,46.056247
2019-430,2019-02-22,000001,Vente,95000,5167,,OUSSIAT,B063,01160,01304,Pont-d'Ain,01,,,01304000AH0102,,,,,,,,,,,,,0,3,Dépendance,,0,S,sols,,,82,5.359681,46.056497
2019-430,2019-02-22,000001,Vente,95000,5163,,OUSSIAT,B063,01160,01304,Pont-d'Ain,01,,,01304000AH0119,,,,,,,,,,,,,0,1,Maison,82,4,S,sols,,,50,5.359846,46.056637
2019-434,2019-02-28,000001,Vente,122880,53,,RUE LOUISE DE SAVOIE,0160,01160,01304,Pont-d'Ain,01,,,01304000AM0155,,,,,,,,,,,,,0,1,Maison,118,5,S,sols,,,145,5.343843,46.050527
2019-447,2019-02-15,000002,Vente,162000,,,OUSSIAT,B063,01160,01304,Pont-d'Ain,01,,,01304000AH0029,,,,,,,,,,,,,0,,,,,L,landes,PATUR,Pâture plantée,822,,
2019-447,2019-02-15,000002,Vente,162000,5196,,OUSSIAT,B063,01160,01304,Pont-d'Ain,01,,,01304000AH0030,,,2,,,,,,,,,,1,1,Maison,53,3,,,,,,,
2019-447,2019-02-15,000002,Vente,162000,5196,,OUSSIAT,B063,01160,01304,Pont-d'Ain,01,,,01304000AH0030,,,1,,,,,,,,,,1,1,Maison,45,2,,,,,,,
2019-448,2019-02-21,000001,Vente,77000,,,COTES DU CHENE,B030,01160,01304,Pont-d'Ain,01,,,01304000AC0078,,,,,,,,,,,,,0,,,,,L,landes,PATUR,Pâture plantée,615,5.336512,46.052372
2019-448,2019-02-21,000001,Vente,77000,,,COTES DU CHENE,B030,01160,01304,Pont-d'Ain,01,,,01304000AC0079,,,,,,,,,,,,,0,,,,,J,jardins,,,416,5.335739,46.052297
2019-448,2019-02-21,000001,Vente,77000,5382,,RUE SAINT EXUPERY,0260,01160,01304,Pont-d'Ain,01,,,01304000AC0080,,,,,,,,,,,,,0,1,Maison,72,3,S,sols,,,75,5.335361,46.052274
2019-595,2019-03-15,000001,Vente,185000,1,,RUE SAINT EXUPERY,0260,01160,01304,Pont-d'Ain,01,,,01304000AM0036,,,1,,,,,,,,,,1,4,Local industriel. commercial ou assimilé,40,0,,,,,,5.33593,46.049347
2019-595,2019-03-15,000001,Vente,185000,1,,RUE SAINT EXUPERY,0260,01160,01304,Pont-d'Ain,01,,,01304000AM0036,,,2,121.04,,,,,,,,,1,2,Appartement,60,3,,,,,,5.33593,46.049347
2019-595,2019-03-15,000001,Vente,185000,1,,RUE SAINT EXUPERY,0260,01160,01304,Pont-d'Ain,01,,,01304000AM0036,,,2,121.04,,,,,,,,,1,2,Appartement,45,2,,,,,,5.33593,46.049347
2019-595,2019-03-15,000001,Vente,185000,,,COTES DU PORT,B032,01160,01304,Pont-d'Ain,01,,,01304000AM0037,,,,,,,,,,,,,0,,,,,L,landes,PATUR,Pâture plantée,398,5.336499,46.049711
2019-599,2019-03-09,000001,Vente,162350,5737,,DERRIERE LE CHATEAU,B036,01160,01304,Pont-d'Ain,01,,,01304000AD0260,,,,,,,,,,,,,0,1,Maison,99,4,S,sols,,,915,5.343502,46.053866
2019-646,2019-03-18,000001,Vente,109000,57,,RUE LOUISE DE SAVOIE,0160,01160,01304,Pont-d'Ain,01,,,01304000AM0153,,,,,,,,,,,,,0,3,Dépendance,,0,S,sols,,,537,5.343949,46.050609
2019-646,2019-03-18,000001,Vente,109000,57,,RUE LOUISE DE SAVOIE,0160,01160,01304,Pont-d'Ain,01,,,01304000AM0153,,,,,,,,,,,,,0,2,Appartement,64,1,S,sols,,,537,5.343949,46.050609
2019-646,2019-03-18,000001,Vente,109000,57,,RUE LOUISE DE SAVOIE,0160,01160,01304,Pont-d'Ain,01,,,01304000AM0153,,,,,,,,,,,,,0,2,Appartement,57,1,S,sols,,,537,5.343949,46.050609
2019-646,2019-03-18,000001,Vente,109000,57,,RUE LOUISE DE SAVOIE,0160,01160,01304,Pont-d'Ain,01,,,01304000AM0153,,,,,,,,,,,,,0,2,Appartement,58,2,S,sols,,,537,5.343949,46.050609
2019-646,2019-03-18,000001,Vente,109000,57,,RUE LOUISE DE SAVOIE,0160,01160,01304,Pont-d'Ain,01,,,01304000AM0153,,,,,,,,,,,,,0,2,Appartement,100,2,S,sols,,,537,5.343949,46.050609
2019-716,2019-03-20,000001,Vente,229760,4,,RUE DE LA CATHERINETTE,0045,01160,01304,Pont-d'Ain,01,,,01304000ZC0370,,,,,,,,,,,,,0,1,Maison,111,5,S,sols,,,800,5.337212,46.056784
2019-816,2019-03-15,000001,Vente,12000,,,COTES DU CHENE,B030,01160,01304,Pont-d'Ain,01,,,01304000AC0090,,,,,,,,,,,,,0,,,,,T,terres,,,1349,5.335836,46.051884
2019-829,2019-03-18,000001,Vente,80000,2,,RUE DU 1ER SEPTEMBRE 1944,0240,01160,01304,Pont-d'Ain,01,,,01304000AM0241,,,20,65.81,4,,45,,,,,,3,2,Appartement,66,3,,,,,,5.33528,46.048893
2019-840,2019-04-01,000001,Vente,96000,2,,RUE DU 1ER SEPTEMBRE 1944,0240,01160,01304,Pont-d'Ain,01,,,01304000AM0241,,,17,65.44,3,,37,,,,,,3,2,Appartement,65,3,,,,,,5.33528,46.048893
2019-841,2019-03-25,000001,Vente,20000,71,,RUE LOUISE DE SAVOIE,0160,01160,01304,Pont-d'Ain,01,,,01304000AE0072,,,,,,,,,,,,,0,1,Maison,40,3,S,sols,,,64,5.345439,46.051348
2019-858,2019-03-29,000001,Vente,93000,5211,,FAUBOURG D EN HAUT,B040,01160,01304,Pont-d'Ain,01,,,01304000AE0122,,,,,,,,,,,,,0,1,Maison,110,4,S,sols,,,175,5.346955,46.053655
2019-858,2019-03-29,000001,Vente,93000,,,FAUBOURG D EN HAUT,B040,01160,01304,Pont-d'Ain,01,,,01304000AE0372,,,,,,,,,,,,,0,,,,,L,landes,PATUR,Pâture plantée,101,5.346936,46.05379
2019-899,2019-04-05,000001,Vente,170000,5922,,RUE DU 1ER SEPTEMBRE 1944,0240,01160,01304,Pont-d'Ain,01,,,01304000AN0156,,,,,,,,,,,,,0,1,Maison,106,4,S,sols,,,950,5.330046,46.049561
2019-899,2019-04-05,000001,Vente,170000,,,SOUS LES PAS,B094,01160,01304,Pont-d'Ain,01,,,01304000AN0159,,,,,,,,,,,,,0,,,,,AB,terrains a bâtir,,,461,5.329893,46.049287
2019-908,2019-02-25,000001,Vente,120000,51,L,RUE DU 1ER SEPTEMBRE 1944,0240,01160,01304,Pont-d'Ain,01,,,01304000AB0240,,,,,,,,,,,,,0,4,Local industriel. commercial ou assimilé,62,0,S,sols,,,134,5.329437,46.049956
2019-908,2019-02-25,000001,Vente,120000,51,N,RUE DU 1ER SEPTEMBRE 1944,0240,01160,01304,Pont-d'Ain,01,,,01304000AB0242,,,,,,,,,,,,,0,4,Local industriel. commercial ou assimilé,41,0,S,sols,,,46,5.32994,46.050087
2019-908,2019-02-25,000001,Vente,120000,51,O,RUE DU 1ER SEPTEMBRE 1944,0240,01160,01304,Pont-d'Ain,01,,,01304000AB0243,,,,,,,,,,,,,0,4,Local industriel. commercial ou assimilé,38,0,S,sols,,,40,5.329964,46.05014
2019-908,2019-02-25,000001,Vente,120000,51,P,RUE DU 1ER SEPTEMBRE 1944,0240,01160,01304,Pont-d'Ain,01,,,01304000AB0244,,,,,,,,,,,,,0,4,Local industriel. commercial ou assimilé,38,0,S,sols,,,40,5.329973,46.050206
2019-908,2019-02-25,000001,Vente,120000,51,Q,RUE DU 1ER SEPTEMBRE 1944,0240,01160,01304,Pont-d'Ain,01,,,01304000AB0245,,,,,,,,,,,,,0,4,Local industriel. commercial ou assimilé,32,0,S,sols,,,34,5.329987,46.050263
2019-908,2019-02-25,000001,Vente,120000,51,R,RUE DU 1ER SEPTEMBRE 1944,0240,01160,01304,Pont-d'Ain,01,,,01304000AB0246,,,,,,,,,,,,,0,4,Local industriel. commercial ou assimilé,38,0,S,sols,,,40,5.329999,46.050319
2019-908,2019-02-25,000001,Vente,120000,51,M,RUE DU 1ER SEPTEMBRE 1944,0240,01160,01304,Pont-d'Ain,01,,,01304000AB0261,,,,,,,,,,,,,0,4,Local industriel. commercial ou assimilé,100,0,S,sols,,,168,5.329824,46.04991
2019-908,2019-02-25,000001,Vente,120000,,,LES TEPPES,B099,01160,01304,Pont-d'Ain,01,,,01304000AB0262,,,,,,,,,,,,,0,,,,,S,sols,,,140,5.329614,46.049923
2019-921,2019-03-29,000001,Vente,208400,6088,,PAMPIER,B065,01160,01304,Pont-d'Ain,01,,,01304000ZC0284,,,,,,,,,,,,,0,1,Maison,85,3,S,sols,,,1144,5.34367,46.056502
2019-958,2019-04-04,000001,Vente,54738.15,,,PRE BIGOT,B079,01160,01304,Pont-d'Ain,01,,,01304000ZE0103,,,,,,,,,,,,,0,,,,,T,terres,,,1320,,
2019-958,2019-04-04,000001,Vente,54738.15,,,PRE BIGOT,B079,01160,01304,Pont-d'Ain,01,,,01304000ZE0105,,,,,,,,,,,,,0,,,,,T,terres,,,7943,,
2019-1015,2019-04-15,000001,Vente,122500,113,,RUE LOUISE DE SAVOIE,0160,01160,01304,Pont-d'Ain,01,,,01304000AE0110,,,,,,,,,,,,,0,1,Maison,30,1,S,sols,,,129,5.346797,46.052576
2019-1015,2019-04-15,000001,Vente,122500,115,,RUE LOUISE DE SAVOIE,0160,01160,01304,Pont-d'Ain,01,,,01304000AE0111,,,,,,,,,,,,,0,1,Maison,124,5,S,sols,,,129,5.34683,46.052619
2019-1172,2019-04-26,000001,Vente,129000,,,FAUBOURG D EN HAUT,B040,01160,01304,Pont-d'Ain,01,,,01304000AE0177,,,,,,,,,,,,,0,,,,,BT,taillis simples,,,1624,5.348884,46.054678
2019-1172,2019-04-26,000001,Vente,129000,,,COTES DU PORT,B032,01160,01304,Pont-d'Ain,01,,,01304000AM0058,,,,,,,,,,,,,0,,,,,P,prés,,,1374,5.337725,46.050406
2019-1172,2019-04-26,000001,Vente,129000,,,COTES DU PORT,B032,01160,01304,Pont-d'Ain,01,,,01304000AM0059,,,,,,,,,,,,,0,,,,,P,prés,,,1640,5.337847,46.049987
2019-1172,2019-04-26,000001,Vente,129000,40,,RUE BERNARD GANGLOFF,0001,01160,01304,Pont-d'Ain,01,,,01304000AM0339,,,,,,,,,,,,,0,2,Appartement,71,5,S,sols,,,124,5.338042,46.049369
2019-1172,2019-04-26,000001,Vente,129000,40,,RUE BERNARD GANGLOFF,0001,01160,01304,Pont-d'Ain,01,,,01304000AM0339,,,,,,,,,,,,,0,2,Appartement,90,3,S,sols,,,124,5.338042,46.049369
2019-1174,2019-04-19,000001,Vente,82300,,,BOIS DU CHENE,B007,01160,01304,Pont-d'Ain,01,,,01304000AC0009,,,1,,4,,6,,,,,,3,2,Appartement,105,3,,,,,,5.333805,46.056285
2019-1176,2019-04-26,000002,Vente,57804,,,BROTTEAUX DU BLANCHON,B013,01160,01304,Pont-d'Ain,01,,,01304000AK0235,,,,,,,,,,,,,0,,,,,S,sols,,,4817,5.352693,46.046612
2019-1185,2019-04-24,000001,Vente,112000,103,,RUE LOUISE DE SAVOIE,0160,01160,01304,Pont-d'Ain,01,,,01304000AE0106,,,,,,,,,,,,,0,1,Maison,97,4,S,sols,,,145,5.346381,46.052223
2019-1389,2019-05-16,000001,Vente,99800,,,BOIS DU CHENE,B007,01160,01304,Pont-d'Ain,01,,,01304000AC0009,,,2,67.23,3,,5,,,,,,3,2,Appartement,105,3,,,,,,5.333805,46.056285
2019-1398,2019-05-23,000001,Vente,130000,20,,RTE DE GENEVE,0100,01160,01304,Pont-d'Ain,01,,,01304000AE0382,,,,,,,,,,,,,0,1,Maison,90,4,S,sols,,,618,5.348502,46.054204
2019-1690,2019-06-13,000001,Vente,63000,5978,,OUSSIAT,B063,01160,01304,Pont-d'Ain,01,,,01304000AH0421,,,,,,,,,,,,,0,1,Maison,50,1,S,sols,,,97,5.359566,46.056082
2019-1823,2019-07-02,000001,Vente,233300,23,,RUE DE LA CATHERINETTE,0045,01160,01304,Pont-d'Ain,01,,,01304000ZC0329,,,,,,,,,,,,,0,1,Maison,109,5,S,sols,,,883,5.337587,46.05599
2019-1840,2019-06-24,000001,Vente,159500,5251,,MONT ROCHON,B054,01160,01304,Pont-d'Ain,01,,,013040000A0270,,,,,,,,,,,,,0,1,Maison,130,3,S,sols,,,403,5.338332,46.070019
2019-1883,2019-07-02,000002,Echange,5494.8,,,SUR L ILE,B047,01160,01304,Pont-d'Ain,01,,,01304000AN0137,,,,,,,,,,,,,0,,,,,S,sols,,,862,5.328764,46.049572
2019-1883,2019-07-02,000002,Echange,5494.8,,,SUR L ILE,B047,01160,01304,Pont-d'Ain,01,,,01304000AN0270,,,,,,,,,,,,,0,,,,,BT,taillis simples,,,584,5.327988,46.04985
2019-1913,2019-06-28,000001,Vente,31500,16,,RUE DU 1ER SEPTEMBRE 1944,0240,01160,01304,Pont-d'Ain,01,,,01304000AM0400,,,6,10.8,,,,,,,,,1,4,Local industriel. commercial ou assimilé,10,0,,,,,,5.334132,46.049156
2019-2102,2019-07-23,000001,Vente,5000,,,FAUBOURG D EN HAUT,B040,01160,01304,Pont-d'Ain,01,,,01304000AE0232,,,,,,,,,,,,,0,,,,,J,jardins,,,110,5.348211,46.053769
2019-2102,2019-07-23,000001,Vente,5000,,,FAUBOURG D EN HAUT,B040,01160,01304,Pont-d'Ain,01,,,01304000AE0233,,,,,,,,,,,,,0,,,,,L,landes,FRICH,Friche,114,5.348336,46.053629
2019-2102,2019-07-23,000001,Vente,5000,,,FAUBOURG D EN HAUT,B040,01160,01304,Pont-d'Ain,01,,,01304000AE0234,,,,,,,,,,,,,0,,,,,L,landes,FRICH,Friche,78,5.348285,46.053606
2019-2102,2019-07-23,000001,Vente,5000,,,FAUBOURG D EN HAUT,B040,01160,01304,Pont-d'Ain,01,,,01304000AE0235,,,,,,,,,,,,,0,,,,,J,jardins,,,64,5.348182,46.053722
2019-2175,2019-07-31,000001,Vente,146900,5562,,LE BLANCHON,B003,01160,01304,Pont-d'Ain,01,,,013040000E0487,,,,,,,,,,,,,0,1,Maison,208,5,S,sols,,,243,5.346639,46.043807
2019-2289,2019-07-19,000001,Vente,625000,6078,,RUE GABRIEL VICAIRE,0080,01160,01304,Pont-d'Ain,01,,,01304000AL0143,,,,,,,,,,,,,0,4,Local industriel. commercial ou assimilé,850,0,S,sols,,,2108,5.33676,46.045298
2019-2289,2019-07-19,000001,Vente,625000,2,,RUE GABRIEL VICAIRE,0080,01160,01304,Pont-d'Ain,01,,,01304000AL0164,,,,,,,,,,,,,0,,,,,S,sols,,,236,5.336556,46.045552
2019-2289,2019-07-19,000001,Vente,625000,2,,RUE GABRIEL VICAIRE,0080,01160,01304,Pont-d'Ain,01,,,01304000AL0165,,,,,,,,,,,,,0,4,Local industriel. commercial ou assimilé,80,0,S,sols,,,982,5.336521,46.045307
2019-2289,2019-07-19,000001,Vente,625000,5,,AV DE L OISELON,0200,01160,01304,Pont-d'Ain,01,,,01304000AL0182,,,,,,,,,,,,,0,,,,,S,sols,,,12,5.337105,46.04564
2019-2395,2019-07-31,000001,Vente,212450,5805,,NECUDEY,B062,01160,01304,Pont-d'Ain,01,,,013040000C0534,,,,,,,,,,,,,0,3,Dépendance,,0,S,sols,,,834,5.332042,46.058883
2019-2395,2019-07-31,000001,Vente,212450,5805,,NECUDEY,B062,01160,01304,Pont-d'Ain,01,,,013040000C0534,,,,,,,,,,,,,0,1,Maison,109,5,S,sols,,,834,5.332042,46.058883
2019-2395,2019-07-31,000001,Vente,212450,5805,,NECUDEY,B062,01160,01304,Pont-d'Ain,01,,,013040000C0534,,,,,,,,,,,,,0,3,Dépendance,,0,AG,terrains d'agrément,,,1552,5.332042,46.058883
2019-2395,2019-07-31,000001,Vente,212450,5805,,NECUDEY,B062,01160,01304,Pont-d'Ain,01,,,013040000C0534,,,,,,,,,,,,,0,1,Maison,109,5,AG,terrains d'agrément,,,1552,5.332042,46.058883
2019-2397,2019-08-02,000001,Vente,205540,6151,,RUE DE LA CATHERINETTE,0045,01160,01304,Pont-d'Ain,01,,,01304000ZC0306,,,,,,,,,,,,,0,1,Maison,108,5,S,sols,,,506,5.339423,46.055471
2019-2414,2019-08-02,000001,Vente,108000,,,LA VIGNETTE,B113,01160,01304,Pont-d'Ain,01,,,01304000ZB0246,,,,,,,,,,,,,0,,,,,P,prés,,,2737,5.358581,46.056883
2019-2449,2019-08-07,000001,Vente,30000,110,,RUE LOUISE DE SAVOIE,0160,01160,01304,Pont-d'Ain,01,,,01304000AE0045,,,,,,,,,,,,,0,2,Appartement,44,2,S,sols,,,84,5.346418,46.052659
2019-2449,2019-08-07,000001,Vente,30000,110,,RUE LOUISE DE SAVOIE,0160,01160,01304,Pont-d'Ain,01,,,01304000AE0045,,,,,,,,,,,,,0,2,Appartement,55,2,S,sols,,,84,5.346418,46.052659
2019-2449,2019-08-07,000001,Vente,30000,110,,RUE LOUISE DE SAVOIE,0160,01160,01304,Pont-d'Ain,01,,,01304000AE0045,,,,,,,,,,,,,0,2,Appartement,59,2,S,sols,,,84,5.346418,46.052659
2019-2482,2019-08-27,000001,Vente,113500,5188,,OUSSIAT,B063,01160,01304,Pont-d'Ain,01,,,01304000AH0087,,,,,,,,,,,,,0,1,Maison,125,4,S,sols,,,755,5.360642,46.055894
2019-2547,2019-08-30,000001,Vente,83000,86,,RUE LOUISE DE SAVOIE,0160,01160,01304,Pont-d'Ain,01,,,01304000AE0058,,,2,60.28,,,,,,,,,1,2,Appartement,60,2,,,,,,5.345554,46.051925
2019-2587,2019-08-29,000001,Vente,139260,2,,RTE DE GENEVE,0100,01160,01304,Pont-d'Ain,01,,,01304000AE0121,,,,,,,,,,,,,0,1,Maison,128,6,S,sols,,,234,5.347034,46.0536
2019-2657,2019-09-09,000001,Vente,60000,,,VILLAGE DU BLANCHON,B114,01160,01304,Pont-d'Ain,01,,,013040000E0733,,,,,,,,,,,,,0,,,,,AG,terrains d'agrément,,,18,5.351693,46.041032
2019-2657,2019-09-09,000001,Vente,60000,,,VILLAGE DU BLANCHON,B114,01160,01304,Pont-d'Ain,01,,,013040000E0739,,,,,,,,,,,,,0,,,,,AB,terrains a bâtir,,,539,5.351918,46.040955
2019-2662,2019-09-19,000001,Vente,1690,,,TERRE DU GRANGEON,B103,01160,01304,Pont-d'Ain,01,,,01304000ZC0118,,,,,,,,,,,,,0,,,,,T,terres,,,5630,5.346749,46.057501
2019-2663,2019-09-19,000001,Vente,4200,,,TERRE DE L ILE,B100,01160,01304,Pont-d'Ain,01,,,01304000AE0274,,,,,,,,,,,,,0,,,,,T,terres,,,1551,5.350574,46.053839
2019-2663,2019-09-19,000001,Vente,4200,,,TERRE DE L ILE,B100,01160,01304,Pont-d'Ain,01,,,01304000AE0275,,,,,,,,,,,,,0,,,,,T,terres,,,1292,5.350716,46.053887
2019-2781,2019-10-01,000001,Vente,175000,21,,RUE BRILLAT SAVARIN,0020,01160,01304,Pont-d'Ain,01,,,01304000AM0359,,,,,,,,,,,,,0,2,Appartement,80,3,S,sols,,,253,5.335598,46.048183
2019-2781,2019-10-01,000001,Vente,175000,21,,RUE BRILLAT SAVARIN,0020,01160,01304,Pont-d'Ain,01,,,01304000AM0359,,,,,,,,,,,,,0,2,Appartement,80,3,S,sols,,,253,5.335598,46.048183
2019-2781,2019-10-01,000001,Vente,175000,21,,RUE BRILLAT SAVARIN,0020,01160,01304,Pont-d'Ain,01,,,01304000AM0359,,,,,,,,,,,,,0,4,Local industriel. commercial ou assimilé,130,0,S,sols,,,253,5.335598,46.048183
2019-2826,2019-09-26,000001,Vente,,,,PRE BIGOT,B079,01160,01304,Pont-d'Ain,01,,,01304000ZE0046,,,,,,,,,,,,,0,,,,,P,prés,,,150,5.35319,46.036015
2019-2898,2019-09-30,000001,Vente,42000,,,BROTTEAUX DU BLANCHON,B013,01160,01304,Pont-d'Ain,01,,,01304000AK0234,,,,,,,,,,,,,0,,,,,S,sols,,,3500,5.357315,46.048452
2019-2925,2019-09-30,000001,Vente,720000,51,D,RUE DU 1ER SEPTEMBRE 1944,0240,01160,01304,Pont-d'Ain,01,,,01304000AB0232,,,,,,,,,,,,,0,4,Local industriel. commercial ou assimilé,438,0,S,sols,,,273,5.327972,46.050207
2019-2925,2019-09-30,000001,Vente,720000,51,E,RUE DU 1ER SEPTEMBRE 1944,0240,01160,01304,Pont-d'Ain,01,,,01304000AB0233,,,,,,,,,,,,,0,4,Local industriel. commercial ou assimilé,782,0,S,sols,,,559,5.32855,46.050062
2019-2925,2019-09-30,000001,Vente,720000,,,LES TEPPES,B099,01160,01304,Pont-d'Ain,01,,,01304000AB0234,,,,,,,,,,,,,0,,,,,S,sols,,,311,5.328209,46.050325
2019-2925,2019-09-30,000001,Vente,720000,51,K,RUE DU 1ER SEPTEMBRE 1944,0240,01160,01304,Pont-d'Ain,01,,,01304000AB0239,,,,,,,,,,,,,0,2,Appartement,88,4,S,sols,,,252,5.329172,46.049997
2019-2925,2019-09-30,000001,Vente,720000,51,K,RUE DU 1ER SEPTEMBRE 1944,0240,01160,01304,Pont-d'Ain,01,,,01304000AB0239,,,,,,,,,,,,,0,2,Appartement,88,4,S,sols,,,252,5.329172,46.049997
2019-2925,2019-09-30,000001,Vente,720000,51,K,RUE DU 1ER SEPTEMBRE 1944,0240,01160,01304,Pont-d'Ain,01,,,01304000AB0239,,,,,,,,,,,,,0,2,Appartement,88,4,S,sols,,,252,5.329172,46.049997
2019-2925,2019-09-30,000001,Vente,720000,51,K,RUE DU 1ER SEPTEMBRE 1944,0240,01160,01304,Pont-d'Ain,01,,,01304000AB0239,,,,,,,,,,,,,0,2,Appartement,88,4,S,sols,,,252,5.329172,46.049997
2019-2925,2019-09-30,000001,Vente,720000,,,SUR L ILE,B047,01160,01304,Pont-d'Ain,01,,,01304000AN0269,,,,,,,,,,,,,0,,,,,BT,taillis simples,,,3804,5.327609,46.049824
2019-3034,2019-10-02,000001,Vente,102000,51,A,RUE DU 1ER SEPTEMBRE 1944,0240,01160,01304,Pont-d'Ain,01,,,01304000AB0229,,,,,,,,,,,,,0,4,Local industriel. commercial ou assimilé,208,0,S,sols,,,245,5.328099,46.050827
2019-3034,2019-10-02,000001,Vente,102000,51,S,RUE DU 1ER SEPTEMBRE 1944,0240,01160,01304,Pont-d'Ain,01,,,01304000AB0247,,,,,,,,,,,,,0,4,Local industriel. commercial ou assimilé,86,0,S,sols,,,191,5.330052,46.050499
2019-3054,2019-10-04,000001,Vente,7500,,,MONT ROCHON,B054,01160,01304,Pont-d'Ain,01,,,013040000A0271,,,,,,,,,,,,,0,,,,,S,sols,,,60,5.338336,46.070067
2019-3133,2019-10-29,000001,Vente,109813,6219,,LA PLANTEE,B074,01160,01304,Pont-d'Ain,01,,,01304000ZC0318,,,,,,,,,,,,,0,1,Maison,72,4,S,sols,,,830,5.338531,46.055375
2019-3175,2019-10-16,000001,Vente,128000,5166,,OUSSIAT,B063,01160,01304,Pont-d'Ain,01,,,01304000AH0113,,,,,,,,,,,,,0,1,Maison,59,3,S,sols,,,214,5.359362,46.056693
2019-3175,2019-10-16,000001,Vente,128000,,,OUSSIAT,B063,01160,01304,Pont-d'Ain,01,,,01304000AH0396,,,,,,,,,,,,,0,,,,,S,sols,,,53,5.359432,46.056637
2019-3350,2019-10-21,000001,Vente,116000,20,,RTE DE BOURG,0040,01160,01304,Pont-d'Ain,01,,,013040000C0548,,,,,,,,,,,,,0,1,Maison,91,6,,,,,,5.332079,46.058531
2019-3382,2019-10-21,000001,Vente,1466,,,OUSSIAT,B063,01160,01304,Pont-d'Ain,01,,,01304000AH0531,,,,,,,,,,,,,0,,,,,AB,terrains a bâtir,,,733,5.361573,46.057429
2019-3406,2019-10-22,000001,Vente,117500,,,OUSSIAT,B063,01160,01304,Pont-d'Ain,01,,,01304000AH0180,,,,,,,,,,,,,0,,,,,J,jardins,,,85,5.363488,46.055753
2019-3406,2019-10-22,000001,Vente,117500,5122,,OUSSIAT,B063,01160,01304,Pont-d'Ain,01,,,01304000AH0311,,,,,,,,,,,,,0,1,Maison,90,4,S,sols,,,118,5.361731,46.055155
2019-3406,2019-10-22,000001,Vente,117500,,,OUSSIAT,B063,01160,01304,Pont-d'Ain,01,,,01304000AH0313,,,,,,,,,,,,,0,,,,,S,sols,,,300,5.36175,46.055271
2019-3532,2019-11-14,000001,Vente,1,,,PRE BIGOT,B079,01160,01304,Pont-d'Ain,01,,,01304000ZE0044,,,,,,,,,,,,,0,,,,,T,terres,,,890,5.353188,46.036472
2019-3533,2019-11-14,000001,Vente,465,,,PRE BIGOT,B079,01160,01304,Pont-d'Ain,01,,,01304000ZE0043,,,,,,,,,,,,,0,,,,,AB,terrains a bâtir,CHEM,Chemin (non groupe),2950,,
2019-3533,2019-11-14,000001,Vente,465,,,PRE BIGOT,B079,01160,01304,Pont-d'Ain,01,,,01304000ZE0273,,,,,,,,,,,,,0,,,,,S,sols,,,1982,,
2019-3602,2019-11-27,000001,Vente,155000,22,,QUAI JUSTIN REYMOND,0120,01160,01304,Pont-d'Ain,01,,,01304000AM0300,,,,,,,,,,,,,0,1,Maison,140,5,S,sols,,,284,5.338796,46.048947
2019-3602,2019-11-27,000001,Vente,155000,,,LE PORT,B078,01160,01304,Pont-d'Ain,01,,,01304000AM0452,,,,,,,,,,,,,0,,,,,S,sols,,,49,5.338748,46.049112
2019-3634,2019-11-14,000001,Vente,1133285.5,,,PRE BIGOT,B079,01160,01304,Pont-d'Ain,01,,,01304000ZE0039,,,,,,,,,,,,,0,,,,,T,terres,,,4410,5.352331,46.03816
2019-3634,2019-11-14,000001,Vente,1133285.5,,,PRE BIGOT,B079,01160,01304,Pont-d'Ain,01,,,01304000ZE0040,,,,,,,,,,,,,0,,,,,T,terres,,,2820,5.352331,46.037581
2019-3634,2019-11-14,000001,Vente,1133285.5,,,PRE BIGOT,B079,01160,01304,Pont-d'Ain,01,,,01304000ZE0041,,,,,,,,,,,,,0,,,,,T,terres,,,2870,5.352253,46.037316