id_mutation,date_mutation,numero_disposition,nature_mutation,valeur_fonciere,adresse_numero,adresse_suffixe,adresse_nom_voie,adresse_code_voie,code_postal,code_commune,nom_commune,code_departement,ancien_code_commune,ancien_nom_commune,id_parcelle,ancien_id_parcelle,numero_volume,lot1_numero,lot1_surface_carrez,lot2_numero,lot2_surface_carrez,lot3_numero,lot3_surface_carrez,lot4_numero,lot4_surface_carrez,lot5_numero,lot5_surface_carrez,nombre_lots,code_type_local,type_local,surface_reelle_bati,nombre_pieces_principales,code_nature_culture,nature_culture,code_nature_culture_speciale,nature_culture_speciale,surface_terrain,longitude,latitude
2019-20,2019-01-08,000002,Echange,3240,,,LA GROSSE GRANGE,B109,01560,01380,Saint-Nizier-le-Bouchoux,01,,,01380000YB0090,,,,,,,,,,,,,0,,,,,S,sols,,,612,5.146352,46.461345
2019-20,2019-01-08,000003,Echange,3240,,,LA GROSSE GRANGE,B109,01560,01380,Saint-Nizier-le-Bouchoux,01,,,01380000YB0092,,,,,,,,,,,,,0,,,,,T,terres,,,1004,5.146044,46.460589
2019-188,2019-01-22,000002,Echange,3000,,,LES COMMUNES,B065,01560,01380,Saint-Nizier-le-Bouchoux,01,,,01380000ZY0054,,,,,,,,,,,,,0,,,,,P,prés,,,11080,5.164133,46.461007
2019-188,2019-01-22,000002,Echange,3000,,,LES COMMUNES,B065,01560,01380,Saint-Nizier-le-Bouchoux,01,,,01380000ZY0177,,,,,,,,,,,,,0,,,,,P,prés,,,4321,5.164426,46.460084
2019-188,2019-01-22,000003,Echange,3000,,,CHAMP BUCLET,B033,01560,01380,Saint-Nizier-le-Bouchoux,01,,,01380000ZY0047,,,,,,,,,,,,,0,,,,,T,terres,,,7390,5.170626,46.461497
2019-188,2019-01-22,000003,Echange,3000,,,CHAMP BUCLET,B033,01560,01380,Saint-Nizier-le-Bouchoux,01,,,01380000ZY0050,,,,,,,,,,,,,0,,,,,T,terres,,,8010,5.16795,46.461936
2019-642,2019-03-08,000001,Vente,58000,,,GRAND MEPILLAT,B100,01560,01380,Saint-Nizier-le-Bouchoux,01,,,01380000ZM0129,,,,,,,,,,,,,0,,,,,J,jardins,,,829,5.183985,46.451453
2019-642,2019-03-08,000001,Vente,58000,,,GRAND MEPILLAT,B100,01560,01380,Saint-Nizier-le-Bouchoux,01,,,01380000ZM0132,,,,,,,,,,,,,0,,,,,P,prés,,,1176,5.184777,46.451469
2019-642,2019-03-08,000001,Vente,58000,353,,RTE DE MEPILLAT,0235,01560,01380,Saint-Nizier-le-Bouchoux,01,,,01380000ZM0133,,,,,,,,,,,,,0,1,Maison,77,3,S,sols,,,1400,5.184309,46.451732
2019-642,2019-03-08,000001,Vente,58000,,,GRAND MEPILLAT,B100,01560,01380,Saint-Nizier-le-Bouchoux,01,,,01380000ZM0134,,,,,,,,,,,,,0,,,,,S,sols,,,239,5.184126,46.451646
2019-642,2019-03-08,000001,Vente,58000,,,GRAND MEPILLAT,B100,01560,01380,Saint-Nizier-le-Bouchoux,01,,,01380000ZM0134,,,,,,,,,,,,,0,,,,,P,prés,,,1054,5.184126,46.451646
2019-1111,2019-04-26,000001,Vente,2000,,,LA QUESTION,B162,01560,01380,Saint-Nizier-le-Bouchoux,01,,,013800000D0194,,,,,,,,,,,,,0,,,,,BS,taillis sous futaie,,,5648,5.16519,46.438827
2019-1111,2019-04-26,000001,Vente,2000,,,LA QUESTION,B162,01560,01380,Saint-Nizier-le-Bouchoux,01,,,013800000D0197,,,,,,,,,,,,,0,,,,,T,terres,,,2033,5.166977,46.43862
2019-1111,2019-04-26,000001,Vente,2000,,,LA QUESTION,B162,01560,01380,Saint-Nizier-le-Bouchoux,01,,,013800000D0198,,,,,,,,,,,,,0,,,,,BS,taillis sous futaie,,,11190,5.165954,46.438312
2019-1688,2019-06-20,000001,Vente,6600,,,VERCEY,B197,01560,01380,Saint-Nizier-le-Bouchoux,01,,,01380000ZI0025,,,,,,,,,,,,,0,,,,,P,prés,,,60040,5.20017,46.464003
2019-1958,2019-07-19,000001,Vente,400,,,LE CHARNAY,B057,01560,01380,Saint-Nizier-le-Bouchoux,01,,,01380000ZS0098,,,,,,,,,,,,,0,,,,,BS,taillis sous futaie,,,804,5.185554,46.443055
2019-2439,2019-08-27,000002,Vente,550,,,MATRIGNAT,B211,01560,01380,Saint-Nizier-le-Bouchoux,01,,,01380000ZC0141,,,,,,,,,,,,,0,,,,,S,sols,,,54,5.206207,46.48025
2019-2439,2019-08-27,000002,Vente,550,,,MATRIGNAT,B211,01560,01380,Saint-Nizier-le-Bouchoux,01,,,01380000ZC0142,,,,,,,,,,,,,0,,,,,AG,terrains d'agrément,JARD,Jardin d'agrément,1,5.206461,46.480208
2019-2993,2019-10-04,000001,Vente,222220,2130,,RTE DE SAINT JULIEN,0003,01560,01380,Saint-Nizier-le-Bouchoux,01,,,01380000YD0100,,,,,,,,,,,,,0,2,Appartement,88,3,S,sols,,,3620,5.153312,46.442573
2019-2993,2019-10-04,000001,Vente,222220,2130,,RTE DE SAINT JULIEN,0003,01560,01380,Saint-Nizier-le-Bouchoux,01,,,01380000YD0100,,,,,,,,,,,,,0,2,Appartement,122,5,S,sols,,,3620,5.153312,46.442573
2019-2993,2019-10-04,000001,Vente,222220,,,PETIT MONTRACHY,B138,01560,01380,Saint-Nizier-le-Bouchoux,01,,,01380000YD0118,,,,,,,,,,,,,0,,,,,P,prés,,,5939,5.152378,46.442196
2019-2993,2019-10-04,000001,Vente,222220,,,PETIT MONTRACHY,B138,01560,01380,Saint-Nizier-le-Bouchoux,01,,,01380000YD0118,,,,,,,,,,,,,0,,,,,P,prés,,,2969,5.152378,46.442196
2019-2993,2019-10-04,000001,Vente,222220,,,PETIT MONTRACHY,B138,01560,01380,Saint-Nizier-le-Bouchoux,01,,,01380000YD0118,,,,,,,,,,,,,0,,,,,P,prés,,,2969,5.152378,46.442196
2019-3490,2019-11-12,000001,Vente,164250,381,,RTE DE LA RIPETTE,0292,01560,01380,Saint-Nizier-le-Bouchoux,01,,,01380000YB0079,,,,,,,,,,,,,0,1,Maison,107,5,AG,terrains d'agrément,JARD,Jardin d'agrément,2051,5.145456,46.458356
2019-3490,2019-11-12,000001,Vente,164250,381,,RTE DE LA RIPETTE,0292,01560,01380,Saint-Nizier-le-Bouchoux,01,,,01380000YB0079,,,,,,,,,,,,,0,1,Maison,107,5,S,sols,,,800,5.145456,46.458356
2019-3597,2019-11-28,000001,Vente,5700,,,LA QUESTION,B162,01560,01380,Saint-Nizier-le-Bouchoux,01,,,013800000D0198,,,,,,,,,,,,,0,,,,,BS,taillis sous futaie,,,11190,5.165954,46.438312
2019-3677,2019-12-03,000001,Vente,123950,,,MOLESSIAT,B124,01560,01380,Saint-Nizier-le-Bouchoux,01,,,01380000YA0047,,,,,,,,,,,,,0,,,,,L,landes,,,110,5.158371,46.46716
2019-3677,2019-12-03,000001,Vente,123950,,,MOLESSIAT,B124,01560,01380,Saint-Nizier-le-Bouchoux,01,,,01380000YA0048,,,,,,,,,,,,,0,,,,,L,landes,,,190,5.158415,46.467239
2019-3677,2019-12-03,000001,Vente,123950,,,MOLESSIAT,B124,01560,01380,Saint-Nizier-le-Bouchoux,01,,,01380000YA0050,,,,,,,,,,,,,0,,,,,S,sols,,,200,5.158094,46.467282
2019-3677,2019-12-03,000001,Vente,123950,5400,,MOLESSIAT,B124,01560,01380,Saint-Nizier-le-Bouchoux,01,,,01380000YA0051,,,,,,,,,,,,,0,3,Dépendance,,0,S,sols,,,110,5.158057,46.467215
2019-3677,2019-12-03,000001,Vente,123950,159,,IMP DE MOLESSIAT,0253,01560,01380,Saint-Nizier-le-Bouchoux,01,,,01380000YA0052,,,,,,,,,,,,,0,1,Maison,89,4,S,sols,,,380,5.158013,46.467155
2019-3677,2019-12-03,000001,Vente,123950,,,MOLESSIAT,B124,01560,01380,Saint-Nizier-le-Bouchoux,01,,,01380000YA0053,,,,,,,,,,,,,0,,,,,S,sols,,,200,5.157938,46.466977
2019-3677,2019-12-03,000001,Vente,123950,,,MOLESSIAT,B124,01560,01380,Saint-Nizier-le-Bouchoux,01,,,01380000YA0153,,,,,,,,,,,,,0,,,,,P,prés,,,365,5.158428,46.467046
2019-3834,2019-11-25,000001,Vente,1105,,,LE PIOCHAT,B140,01560,01380,Saint-Nizier-le-Bouchoux,01,,,01380000ZY0029,,,,,,,,,,,,,0,,,,,T,terres,,,6140,5.17651,46.460905
2019-4123,2019-12-27,000001,Vente,1,525,,RTE DE SAINT JULIEN,0003,01560,01380,Saint-Nizier-le-Bouchoux,01,,,01380000ZX0177,,,,,,,,,,,,,0,4,Local industriel. commercial ou assimilé,2530,0,S,sols,,,12625,5.153172,46.456416
