id_mutation,date_mutation,numero_disposition,nature_mutation,valeur_fonciere,adresse_numero,adresse_suffixe,adresse_nom_voie,adresse_code_voie,code_postal,code_commune,nom_commune,code_departement,ancien_code_commune,ancien_nom_commune,id_parcelle,ancien_id_parcelle,numero_volume,lot1_numero,lot1_surface_carrez,lot2_numero,lot2_surface_carrez,lot3_numero,lot3_surface_carrez,lot4_numero,lot4_surface_carrez,lot5_numero,lot5_surface_carrez,nombre_lots,code_type_local,type_local,surface_reelle_bati,nombre_pieces_principales,code_nature_culture,nature_culture,code_nature_culture_speciale,nature_culture_speciale,surface_terrain,longitude,latitude
2019-4242,2019-01-03,000001,Vente,475000,216,,RUE DES RENARDES,0048,01210,01435,Versonnex,01,,,01435000AD0319,,,,,,,,,,,,,0,1,Maison,99,5,S,sols,,,567,6.105195,46.294086
2019-4349,2019-01-11,000001,Vente,410000,167,,LOT GENEVRIERS LES COUDRIERS,A026,01210,01435,Versonnex,01,,,01435000AB0157,,,,,,,,,,,,,0,1,Maison,87,4,S,sols,,,405,6.107387,46.306874
2019-4431,2019-01-31,000001,Vente,278000,21,,RTE DE MACONNEX,0035,01210,01435,Versonnex,01,,,01435000AE0061,,,23,,,,,,,,,,1,3,Dépendance,,0,,,,,,6.095607,46.300569
2019-4431,2019-01-31,000001,Vente,278000,21,,RTE DE MACONNEX,0035,01210,01435,Versonnex,01,,,01435000AE0061,,,32,,9,69.31,,,,,,,2,2,Appartement,67,3,,,,,,6.095607,46.300569
2019-4448,2019-01-21,000001,Vente,400000,,,LES VERNES,B033,01210,01435,Versonnex,01,,,01435000AD0050,,,,,,,,,,,,,0,,,,,S,sols,,,291,6.108003,46.295993
2019-4448,2019-01-21,000001,Vente,400000,51,,RUE DU TURET,0054,01210,01435,Versonnex,01,,,01435000AD0096,,,,,,,,,,,,,0,1,Maison,99,5,S,sols,,,480,6.107586,46.2959
2019-4990,2019-02-08,000001,Vente,388700,19,,RUE DU COLOMBY,0013,01210,01435,Versonnex,01,,,01435000AD0085,,,,,,,,,,,,,0,1,Maison,99,5,S,sols,,,516,6.106273,46.296048
2019-5110,2019-02-25,000001,Vente,650000,329,,RTE DE COLLEX BOSSY,0011,01210,01435,Versonnex,01,,,01435000AE0123,,,,,,,,,,,,,0,1,Maison,150,6,S,sols,,,463,6.098423,46.298126
2019-5110,2019-02-25,000001,Vente,650000,329,,RTE DE COLLEX BOSSY,0011,01210,01435,Versonnex,01,,,01435000AE0123,,,,,,,,,,,,,0,1,Maison,150,6,AG,terrains d'agrément,,,1389,6.098423,46.298126
2019-5553,2019-03-25,000001,Vente,765800,118,,RTE DE DIVONNE,0017,01210,01435,Versonnex,01,,,01435000AE0039,,,,,,,,,,,,,0,1,Maison,302,8,S,sols,,,375,6.096657,46.301739
2019-5553,2019-03-25,000001,Vente,765800,,,VERSONNEX,B034,01210,01435,Versonnex,01,,,01435000AE0040,,,,,,,,,,,,,0,,,,,S,sols,,,188,6.096756,46.301711
2019-5553,2019-03-25,000001,Vente,765800,,,VERSONNEX,B034,01210,01435,Versonnex,01,,,01435000AE0392,,,,,,,,,,,,,0,,,,,S,sols,,,312,6.096847,46.301773
2019-5553,2019-03-25,000001,Vente,765800,,,VERSONNEX,B034,01210,01435,Versonnex,01,,,01435000AE0474,,,,,,,,,,,,,0,,,,,S,sols,,,86,6.096916,46.30164
2019-5553,2019-03-25,000001,Vente,765800,,,VERSONNEX,B034,01210,01435,Versonnex,01,,,01435000AE0476,,,,,,,,,,,,,0,,,,,S,sols,,,33,6.096806,46.301567
2019-5934,2019-04-02,000001,Vente,459400,,,BOIS CHATTON,B005,01210,01435,Versonnex,01,,,01435000AD0370,,,,,,,,,,,,,0,,,,,AB,terrains a bâtir,,,13,6.101784,46.293668
2019-5934,2019-04-02,000001,Vente,459400,67,,IMP DE LA COMMANDERIE,0073,01210,01435,Versonnex,01,,,01435000AD0379,,,,,,,,,,,,,0,1,Maison,87,4,AB,terrains a bâtir,,,253,6.10166,46.293661
2019-6970,2019-06-06,000001,Vente,415000,70,,RTE DE DIVONNE,0017,01210,01435,Versonnex,01,,,01435000AE0044,,,4,112.66,,,,,,,,,1,2,Appartement,117,4,,,,,,6.096852,46.301272
2019-7015,2019-06-13,000001,Vente en l'état futur d'achèvement,249000,,,GRAND VERGER,B013,01210,01435,Versonnex,01,,,01435000AA0192,,,5,,,,,,,,,,1,2,Appartement,46,2,,,,,,6.098278,46.305587
2019-7015,2019-06-13,000001,Vente en l'état futur d'achèvement,249000,,,GRAND VERGER,B013,01210,01435,Versonnex,01,,,01435000AA0192,,,48,,,,,,,,,,1,3,Dépendance,,0,,,,,,6.098278,46.305587
2019-7211,2019-06-21,000001,Vente en l'état futur d'achèvement,20000,,,GRAND VERGER,B013,01210,01435,Versonnex,01,,,01435000AA0192,,,47,,,,,,,,,,1,3,Dépendance,,0,,,,,,6.098278,46.305587
2019-7231,2019-06-21,000001,Vente en l'état futur d'achèvement,252000,,,GRAND VERGER,B013,01210,01435,Versonnex,01,,,01435000AA0192,,,44,,,,,,,,,,1,3,Dépendance,,0,,,,,,6.098278,46.305587
2019-7231,2019-06-21,000001,Vente en l'état futur d'achèvement,252000,,,GRAND VERGER,B013,01210,01435,Versonnex,01,,,01435000AA0192,,,74,,,,,,,,,,1,3,Dépendance,,0,,,,,,6.098278,46.305587
2019-7231,2019-06-21,000001,Vente en l'état futur d'achèvement,252000,,,GRAND VERGER,B013,01210,01435,Versonnex,01,,,01435000AA0192,,,17,,,,,,,,,,1,2,Appartement,44,2,,,,,,6.098278,46.305587
2019-7458,2019-07-02,000001,Vente en l'état futur d'achèvement,650000,,,GRAND VERGER,B013,01210,01435,Versonnex,01,,,01435000AA0192,,,60,,,,,,,,,,1,3,Dépendance,,0,,,,,,6.098278,46.305587
2019-7458,2019-07-02,000001,Vente en l'état futur d'achèvement,650000,,,GRAND VERGER,B013,01210,01435,Versonnex,01,,,01435000AA0192,,,32,,,,,,,,,,1,2,Appartement,123,5,,,,,,6.098278,46.305587
2019-7458,2019-07-02,000001,Vente en l'état futur d'achèvement,650000,,,GRAND VERGER,B013,01210,01435,Versonnex,01,,,01435000AA0192,,,79,,,,,,,,,,1,3,Dépendance,,0,,,,,,6.098278,46.305587
2019-7458,2019-07-02,000001,Vente en l'état futur d'achèvement,650000,,,GRAND VERGER,B013,01210,01435,Versonnex,01,,,01435000AA0192,,,80,,,,,,,,,,1,3,Dépendance,,0,,,,,,6.098278,46.305587
2019-7458,2019-07-02,000001,Vente en l'état futur d'achèvement,650000,,,GRAND VERGER,B013,01210,01435,Versonnex,01,,,01435000AA0192,,,61,,,,,,,,,,1,3,Dépendance,,0,,,,,,6.098278,46.305587
2019-7568,2019-06-21,000001,Vente,490000,,,LES GENEVRIERS,B012,01210,01435,Versonnex,01,,,01435000AB0092,,,,,,,,,,,,,0,,,,,S,sols,,,588,6.101399,46.306536
2019-7568,2019-06-21,000001,Vente,490000,20,,LOT GENEVRIERS LE PETIT VERGER,A028,01210,01435,Versonnex,01,,,01435000AB0105,,,,,,,,,,,,,0,1,Maison,148,6,S,sols,,,493,6.101067,46.306471
2019-7590,2019-07-01,000001,Vente,393800,161,,RUE DE LA PETITE PRAIRIE,0040,01210,01435,Versonnex,01,,,01435000AI0138,,,7,79.22,,,,,,,,,1,1,Maison,88,5,,,,,,6.094977,46.302377
2019-7610,2019-07-04,000001,Vente,380000,,,LES GENEVRIERS,B012,01210,01435,Versonnex,01,,,01435000AB0091,,,,,,,,,,,,,0,,,,,S,sols,,,926,6.100922,46.307031
2019-7610,2019-07-04,000001,Vente,380000,6,,LOT GENEVRIERS LE PETIT VERGER,A028,01210,01435,Versonnex,01,,,01435000AB0142,,,,,,,,,,,,,0,1,Maison,97,5,S,sols,,,544,6.100378,46.306585
2019-7610,2019-07-04,000001,Vente,380000,,,LES GENEVRIERS,B012,01210,01435,Versonnex,01,,,01435000AB0149,,,,,,,,,,,,,0,,,,,S,sols,,,802,6.100278,46.306849
2019-7616,2019-07-08,000001,Vente,825000,134,,RUE DU JORAN,0033,01210,01435,Versonnex,01,,,01435000AE0313,,,,,,,,,,,,,0,1,Maison,146,5,S,sols,,,970,6.096223,46.298961
2019-7671,2019-07-11,000001,Vente,385440,,,LES GENEVRIERS,B012,01210,01435,Versonnex,01,,,01435000AB0092,,,,,,,,,,,,,0,,,,,S,sols,,,588,6.101399,46.306536
2019-7671,2019-07-11,000001,Vente,385440,19,,LOT GENEVRIERS LE PETIT VERGER,A028,01210,01435,Versonnex,01,,,01435000AB0104,,,,,,,,,,,,,0,1,Maison,96,5,S,sols,,,383,6.101263,46.306643
2019-7683,2019-06-27,000001,Vente,500000,2,,CHE DE LA DANGEREUSE,0019,01210,01435,Versonnex,01,,,01435000AA0058,,,,,,,,,,,,,0,4,Local industriel. commercial ou assimilé,200,0,S,sols,,,1072,6.099344,46.307102
2019-7683,2019-06-27,000001,Vente,500000,,,LA DANGEREUSE,B011,01210,01435,Versonnex,01,,,01435000AA0076,,,,,,,,,,,,,0,,,,,P,prés,,,550,6.099448,46.306655
2019-7773,2019-07-19,000001,Vente,450000,16,,RUE DU CRET D EAU,0014,01210,01435,Versonnex,01,,,01435000AD0204,,,,,,,,,,,,,0,1,Maison,99,5,S,sols,,,441,6.103272,46.295768
2019-8010,2019-07-25,000002,Vente,220000,,,LES RIPPES,B028,01210,01435,Versonnex,01,,,01435000AD0013,,,,,,,,,,,,,0,,,,,S,sols,,,1087,6.099534,46.296839
2019-8010,2019-07-25,000002,Vente,220000,5418,,IMP DES RIPPES,0080,01210,01435,Versonnex,01,,,01435000AD0018,,,,,,,,,,,,,0,4,Local industriel. commercial ou assimilé,,,S,sols,,,155,6.098893,46.296986
2019-8010,2019-07-25,000002,Vente,220000,,,LES RIPPES,B028,01210,01435,Versonnex,01,,,01435000AD0019,,,,,,,,,,,,,0,,,,,S,sols,,,293,6.099066,46.2967
2019-8107,2019-07-22,000001,Vente,90000,21,,RTE DE MACONNEX,0035,01210,01435,Versonnex,01,,,01435000AE0061,,,2,31.67,,,,,,,,,1,4,Local industriel. commercial ou assimilé,45,0,,,,,,6.095607,46.300569
2019-8162,2019-07-29,000001,Vente en l'état futur d'achèvement,445000,,,GRAND VERGER,B013,01210,01435,Versonnex,01,,,01435000AA0192,,,23,93.3,,,,,,,,,1,2,Appartement,47,2,,,,,,6.098278,46.305587
2019-8162,2019-07-29,000001,Vente en l'état futur d'achèvement,445000,,,GRAND VERGER,B013,01210,01435,Versonnex,01,,,01435000AA0192,,,10,120.7,,,,,,,,,1,2,Appartement,47,2,,,,,,6.098278,46.305587
2019-8172,2019-07-23,000001,Vente en l'état futur d'achèvement,321500,,,GRAND VERGER,B013,01210,01435,Versonnex,01,,,01435000AA0192,,,18,153.8,,,,,,,,,1,2,Appartement,63,2,,,,,,6.098278,46.305587
2019-8172,2019-07-23,000001,Vente en l'état futur d'achèvement,321500,,,GRAND VERGER,B013,01210,01435,Versonnex,01,,,01435000AA0192,,,69,17.9,,,,,,,,,1,3,Dépendance,,0,,,,,,6.098278,46.305587
2019-8172,2019-07-23,000001,Vente en l'état futur d'achèvement,321500,,,GRAND VERGER,B013,01210,01435,Versonnex,01,,,01435000AA0192,,,70,17.9,,,,,,,,,1,3,Dépendance,,0,,,,,,6.098278,46.305587
2019-8294,2019-08-01,000001,Vente en l'état futur d'achèvement,319275,,,GRAND VERGER,B013,01210,01435,Versonnex,01,,,01435000AA0192,,,27,,,,,,,,,,1,2,Appartement,59,3,,,,,,6.098278,46.305587
2019-8294,2019-08-01,000001,Vente en l'état futur d'achèvement,319275,,,GRAND VERGER,B013,01210,01435,Versonnex,01,,,01435000AA0192,,,55,,,,,,,,,,1,3,Dépendance,,0,,,,,,6.098278,46.305587
2019-8297,2019-07-26,000001,Vente en l'état futur d'achèvement,1281227.9,,,GRAND VERGER,B013,01210,01435,Versonnex,01,,,01435000AA0191,,,,,,,,,,,,,0,,,,,P,prés,,,102,6.098027,46.305698
2019-8297,2019-07-26,000001,Vente en l'état futur d'achèvement,1281227.9,,,CHE LEVE,0008,01210,01435,Versonnex,01,,,01435000AA0195,,,,,,,,,,,,,0,,,,,S,sols,,,398,6.097788,46.30547
2019-8297,2019-07-26,000001,Vente en l'état futur d'achèvement,1281227.9,,,GRAND VERGER,B013,01210,01435,Versonnex,01,,,01435000AA0200,,,,,,,,,,,,,0,,,,,P,prés,,,618,6.097811,46.305606
2019-8752,2019-08-29,000001,Vente en l'état futur d'achèvement,444000,,,GRAND VERGER,B013,01210,01435,Versonnex,01,,,01435000AA0192,,,40,,,,,,,,,,1,3,Dépendance,,0,,,,,,6.098278,46.305587
2019-8752,2019-08-29,000001,Vente en l'état futur d'achèvement,444000,,,GRAND VERGER,B013,01210,01435,Versonnex,01,,,01435000AA0192,,,8,,,,,,,,,,1,2,Appartement,83,3,,,,,,6.098278,46.305587
2019-8831,2019-08-23,000001,Vente,438000,59,,ALL DES PEUPLIERS,0041,01210,01435,Versonnex,01,,,01435000AD0256,,,,,,,,,,,,,0,1,Maison,99,5,S,sols,,,326,6.103839,46.295144
2019-8972,2019-08-30,000001,Vente,385000,104,,RUE DES RENARDES,0048,01210,01435,Versonnex,01,,,01435000AD0230,,,,,,,,,,,,,0,1,Maison,99,5,S,sols,,,409,6.103783,46.293983
2019-9099,2019-09-12,000001,Vente en l'état futur d'achèvement,537000,,,GRAND VERGER,B013,01210,01435,Versonnex,01,,,01435000AA0192,,,36,,,,,,,,,,1,3,Dépendance,,0,,,,,,6.098278,46.305587
2019-9099,2019-09-12,000001,Vente en l'état futur d'achèvement,537000,,,GRAND VERGER,B013,01210,01435,Versonnex,01,,,01435000AA0192,,,16,,,,,,,,,,1,2,Appartement,103,4,,,,,,6.098278,46.305587
2019-9308,2019-10-01,000001,Vente en l'état futur d'achèvement,260000,,,GRAND VERGER,B013,01210,01435,Versonnex,01,,,01435000AA0192,,,49,,,,,,,,,,1,3,Dépendance,,0,,,,,,6.098278,46.305587
2019-9308,2019-10-01,000001,Vente en l'état futur d'achèvement,260000,,,GRAND VERGER,B013,01210,01435,Versonnex,01,,,01435000AA0192,,,75,,,,,,,,,,1,3,Dépendance,,0,,,,,,6.098278,46.305587
2019-9308,2019-10-01,000001,Vente en l'état futur d'achèvement,260000,,,GRAND VERGER,B013,01210,01435,Versonnex,01,,,01435000AA0192,,,11,,,,,,,,,,1,2,Appartement,47,2,,,,,,6.098278,46.305587
2019-9635,2019-10-08,000001,Vente en l'état futur d'achèvement,272000,,,GRAND VERGER,B013,01210,01435,Versonnex,01,,,01435000AA0192,,,62,,,,,,,,,,1,3,Dépendance,,0,,,,,,6.098278,46.305587
2019-9635,2019-10-08,000001,Vente en l'état futur d'achèvement,272000,,,GRAND VERGER,B013,01210,01435,Versonnex,01,,,01435000AA0192,,,30,,,,,,,,,,1,2,Appartement,50,2,,,,,,6.098278,46.305587
2019-9636,2019-10-10,000001,Vente en l'état futur d'achèvement,256000,,,GRAND VERGER,B013,01210,01435,Versonnex,01,,,01435000AA0192,,,43,,,,,,,,,,1,3,Dépendance,,0,,,,,,6.098278,46.305587
2019-9636,2019-10-10,000001,Vente en l'état futur d'achèvement,256000,,,GRAND VERGER,B013,01210,01435,Versonnex,01,,,01435000AA0192,,,2,,,,,,,,,,1,2,Appartement,46,2,,,,,,6.098278,46.305587
2019-9704,2019-10-15,000001,Vente,440000,41,,RUE DES VOILNANS,0063,01210,01435,Versonnex,01,,,01435000AD0174,,,,,,,,,,,,,0,1,Maison,99,5,S,sols,,,327,6.101706,46.295046
2019-9763,2019-10-10,000001,Vente,230000,174,,RTE DE DIVONNE,0017,01210,01435,Versonnex,01,,,01435000AE0030,,,1,,,,,,,,,,1,2,Appartement,72,3,,,,,,6.09715,46.302102
2019-9763,2019-10-10,000001,Vente,230000,174,,AUX GRANDES OUCHES,B014,01210,01435,Versonnex,01,,,01435000AE0030,,,17,,,,,,,,,,1,3,Dépendance,,0,,,,,,6.09715,46.302102
2019-9763,2019-10-10,000001,Vente,230000,174,,RTE DE DIVONNE,0017,01210,01435,Versonnex,01,,,01435000AE0030,,,12,,,,,,,,,,1,3,Dépendance,,0,,,,,,6.09715,46.302102
2019-9829,2019-10-28,000001,Vente,424820,97,,ALL DES FAYARDS,0021,01210,01435,Versonnex,01,,,01435000AD0244,,,,,,,,,,,,,0,1,Maison,83,4,S,sols,,,420,6.103734,46.294358
2019-9917,2019-10-17,000001,Vente,413120,,,LES GENEVRIERS,B012,01210,01435,Versonnex,01,,,01435000AB0166,,,,,,,,,,,,,0,,,,,S,sols,,,633,6.106145,46.306521
2019-9917,2019-10-17,000001,Vente,413120,156,,LOT GENEVRIERS LES SEMAILLES,A030,01210,01435,Versonnex,01,,,01435000AB0167,,,,,,,,,,,,,0,1,Maison,100,4,S,sols,,,217,6.106341,46.306654
2019-10144,2019-11-12,000001,Vente en l'état futur d'achèvement,252000,,,GRAND VERGER,B013,01210,01435,Versonnex,01,,,01435000AA0192,,,7,,,,,,,,,,1,2,Appartement,44,2,,,,,,6.098278,46.305587
2019-10144,2019-11-12,000001,Vente en l'état futur d'achèvement,252000,,,GRAND VERGER,B013,01210,01435,Versonnex,01,,,01435000AA0192,,,76,,,,,,,,,,1,3,Dépendance,,0,,,,,,6.098278,46.305587
2019-10144,2019-11-12,000001,Vente en l'état futur d'achèvement,252000,,,GRAND VERGER,B013,01210,01435,Versonnex,01,,,01435000AA0192,,,45,,,,,,,,,,1,3,Dépendance,,0,,,,,,6.098278,46.305587
2019-10298,2019-11-05,000002,Vente,690000,871,,RTE DE DIVONNE,0017,01210,01435,Versonnex,01,,,01435000AA0204,,,,,,,,,,,,,0,1,Maison,129,5,,,,,,6.100022,46.308227
2019-11127,2019-12-02,000001,Vente,441750,288,,RUE DES RENARDES,0048,01210,01435,Versonnex,01,,,01435000AD0301,,,,,,,,,,,,,0,1,Maison,99,5,S,sols,,,405,6.105836,46.294685
