id_mutation,date_mutation,numero_disposition,nature_mutation,valeur_fonciere,adresse_numero,adresse_suffixe,adresse_nom_voie,adresse_code_voie,code_postal,code_commune,nom_commune,code_departement,ancien_code_commune,ancien_nom_commune,id_parcelle,ancien_id_parcelle,numero_volume,lot1_numero,lot1_surface_carrez,lot2_numero,lot2_surface_carrez,lot3_numero,lot3_surface_carrez,lot4_numero,lot4_surface_carrez,lot5_numero,lot5_surface_carrez,nombre_lots,code_type_local,type_local,surface_reelle_bati,nombre_pieces_principales,code_nature_culture,nature_culture,code_nature_culture_speciale,nature_culture_speciale,surface_terrain,longitude,latitude
2019-21528,2019-01-25,000001,Vente,7500,,,DERRIERE LES CLOS,B032,02130,02022,Arcy-Sainte-Restitue,02,,,02022000ZA0039,,,,,,,,,,,,,0,,,,,S,sols,,,188,3.460051,49.254438
2019-21543,2019-01-18,000001,Echange,250,,,LE VILLAGE,B101,02130,02022,Arcy-Sainte-Restitue,02,,,02022000AB0326,,,,,,,,,,,,,0,,,,,S,sols,,,3,3.464056,49.253002
2019-21543,2019-01-18,000001,Echange,250,,,LE VILLAGE,B101,02130,02022,Arcy-Sainte-Restitue,02,,,02022000AB0327,,,,,,,,,,,,,0,,,,,S,sols,,,3,3.464227,49.253027
2019-21543,2019-01-18,000002,Echange,250,,,LE VILLAGE,B101,02130,02022,Arcy-Sainte-Restitue,02,,,02022000AB0325,,,,,,,,,,,,,0,,,,,S,sols,,,2,3.464111,49.252998
2019-22263,2019-07-12,000001,Vente,22500,2,,RUE DU TARN,0095,02130,02022,Arcy-Sainte-Restitue,02,,,02022000AB0096,,,,,,,,,,,,,0,1,Maison,68,3,S,sols,,,148,3.463152,49.25356
2019-22422,2019-08-02,000001,Vente,153900,21,,RUE D ANGLETERRE,0010,02130,02022,Arcy-Sainte-Restitue,02,,,02022000XI0038,,,,,,,,,,,,,0,1,Maison,145,5,S,sols,,,884,3.507621,49.263508
2019-22461,2019-07-26,000001,Vente,162000,3,,RUE DE BUCY,0025,02130,02022,Arcy-Sainte-Restitue,02,,,02022000AB0018,,,,,,,,,,,,,0,1,Maison,131,5,S,sols,,,998,3.462674,49.253212
2019-22461,2019-07-26,000001,Vente,162000,,,LE VILLAGE,B101,02130,02022,Arcy-Sainte-Restitue,02,,,02022000AB0019,,,,,,,,,,,,,0,,,,,J,jardins,,,1881,3.462282,49.253218
2019-22551,2019-08-31,000001,Vente,70000,4,,SERVENAY,A025,02130,02022,Arcy-Sainte-Restitue,02,,,02022000AL0105,,,,,,,,,,,,,0,1,Maison,65,3,S,sols,,,800,3.443772,49.24289
2019-22577,2019-08-22,000001,Vente,39900,2,,RUE DE CRAMAILLE,0041,02130,02022,Arcy-Sainte-Restitue,02,,,02022000AB0167,,,,,,,,,,,,,0,1,Maison,47,2,S,sols,,,650,3.464765,49.250307
2019-22672,2019-09-30,000001,Vente,57900,,,SERVENAY,B095,02130,02022,Arcy-Sainte-Restitue,02,,,02022000AL0107,,,,,,,,,,,,,0,,,,,J,jardins,,,170,3.444526,49.2427
2019-22672,2019-09-30,000001,Vente,57900,5003,,SERVENAY,A025,02130,02022,Arcy-Sainte-Restitue,02,,,02022000AL0108,,,,,,,,,,,,,0,3,Dépendance,,0,S,sols,,,73,3.444378,49.242628
2019-22672,2019-09-30,000001,Vente,57900,,,SERVENAY,B095,02130,02022,Arcy-Sainte-Restitue,02,,,02022000AL0120,,,,,,,,,,,,,0,,,,,J,jardins,,,2400,3.444521,49.24243
2019-22672,2019-09-30,000001,Vente,57900,1,,SERVENAY,A025,02130,02022,Arcy-Sainte-Restitue,02,,,02022000AL0121,,,,,,,,,,,,,0,1,Maison,46,3,S,sols,,,144,3.444423,49.242555
2019-22672,2019-09-30,000001,Vente,57900,,,SERVENAY,B095,02130,02022,Arcy-Sainte-Restitue,02,,,02022000AL0122,,,,,,,,,,,,,0,,,,,S,sols,,,129,3.444602,49.242613
2019-22873,2019-10-18,000001,Vente,131900,1,,RUE D ANGLETERRE,0010,02130,02022,Arcy-Sainte-Restitue,02,,,020220000B0602,,,,,,,,,,,,,0,1,Maison,60,2,S,sols,,,680,3.503934,49.263798
2019-23038,2019-12-13,000001,Vente,120000,,,LE VILLAGE,B101,02130,02022,Arcy-Sainte-Restitue,02,,,02022000AB0075,,,,,,,,,,,,,0,,,,,J,jardins,,,1028,3.465444,49.254121
2019-23038,2019-12-13,000001,Vente,120000,12,,RUE DU TARN,0095,02130,02022,Arcy-Sainte-Restitue,02,,,02022000AB0076,,,,,,,,,,,,,0,1,Maison,75,4,S,sols,,,478,3.465262,49.254265
2019-23250,2019-12-27,000001,Vente,1278000,,,LE VILLAGE (BRANGES),B143,02130,02022,Arcy-Sainte-Restitue,02,,,020220000B0034,,,,,,,,,,,,,0,,,,,J,jardins,,,1333,,
2019-23250,2019-12-27,000001,Vente,1278000,3,,RUE D ARCY,0015,02130,02022,Arcy-Sainte-Restitue,02,,,020220000B0611,,,,,,,,,,,,,0,1,Maison,45,3,S,sols,,,341,3.501185,49.26531
2019-23250,2019-12-27,000001,Vente,1278000,3,,RUE D ARCY,0015,02130,02022,Arcy-Sainte-Restitue,02,,,020220000B0611,,,,,,,,,,,,,0,1,Maison,75,4,S,sols,,,341,3.501185,49.26531
2019-23250,2019-12-27,000001,Vente,1278000,,,LE VILLAGE (BRANGES),B143,02130,02022,Arcy-Sainte-Restitue,02,,,020220000B0613,,,,,,,,,,,,,0,,,,,J,jardins,,,828,3.500908,49.265234
2019-23250,2019-12-27,000001,Vente,1278000,,,LE VILLAGE (BRANGES),B143,02130,02022,Arcy-Sainte-Restitue,02,,,020220000B0613,,,,,,,,,,,,,0,,,,,S,sols,,,30,3.500908,49.265234
2019-23250,2019-12-27,000001,Vente,1278000,1,,RUE DE CUIRY,0047,02130,02022,Arcy-Sainte-Restitue,02,,,020220000B0630,,,,,,,,,,,,,0,1,Maison,115,5,S,sols,,,836,3.500241,49.266675
