id_mutation,date_mutation,numero_disposition,nature_mutation,valeur_fonciere,adresse_numero,adresse_suffixe,adresse_nom_voie,adresse_code_voie,code_postal,code_commune,nom_commune,code_departement,ancien_code_commune,ancien_nom_commune,id_parcelle,ancien_id_parcelle,numero_volume,lot1_numero,lot1_surface_carrez,lot2_numero,lot2_surface_carrez,lot3_numero,lot3_surface_carrez,lot4_numero,lot4_surface_carrez,lot5_numero,lot5_surface_carrez,nombre_lots,code_type_local,type_local,surface_reelle_bati,nombre_pieces_principales,code_nature_culture,nature_culture,code_nature_culture_speciale,nature_culture_speciale,surface_terrain,longitude,latitude
2019-16950,2019-05-14,000001,Vente,80000,6,,PTR PETITE RUE,0053,02250,02039,Autremencourt,02,,,020390000C0419,,,,,,,,,,,,,0,1,Maison,40,2,S,sols,,,563,3.784359,49.704187
2019-16950,2019-05-14,000001,Vente,80000,,,LE VILLAGE,B083,02250,02039,Autremencourt,02,,,020390000C0498,,,,,,,,,,,,,0,,,,,S,sols,,,80,3.784538,49.70425
2019-18485,2019-10-16,000001,Vente,145000,6,,LE SART,B067,02250,02039,Autremencourt,02,,,02039000ZB0020,,,,,,,,,,,,,0,1,Maison,127,5,S,sols,,,868,3.781869,49.703586
2019-18630,2019-11-15,000001,Vente,160000,6,,RUE DE LA CITADELLE,0020,02250,02039,Autremencourt,02,,,02039000ZB0013,,,,,,,,,,,,,0,1,Maison,105,4,S,sols,,,996,3.783584,49.704098
2019-18631,2019-11-16,000001,Vente,148000,8,,LE SART,B067,02250,02039,Autremencourt,02,,,02039000ZB0021,,,,,,,,,,,,,0,1,Maison,110,4,S,sols,,,886,3.781481,49.703377
2019-19130,2019-12-23,000002,Vente,40000,,,ERAULCOURT,B041,02250,02039,Autremencourt,02,,,02039000ZH0001,,,,,,,,,,,,,0,,,,,S,sols,,,500,3.811815,49.711226
2019-19130,2019-12-23,000002,Vente,40000,,,ERAULCOURT,B041,02250,02039,Autremencourt,02,,,02039000ZH0001,,,,,,,,,,,,,0,,,,,J,jardins,,,1955,3.811815,49.711226
2019-19130,2019-12-23,000002,Vente,40000,,,ERAULCOURT,B041,02250,02039,Autremencourt,02,,,02039000ZH0008,,,,,,,,,,,,,0,,,,,J,jardins,,,254,3.811412,49.711136
2019-19130,2019-12-23,000002,Vente,40000,,,ERAULCOURT,B041,02250,02039,Autremencourt,02,,,02039000ZH0017,,,,,,,,,,,,,0,,,,,T,terres,,,95,3.81143,49.711277
2019-19130,2019-12-23,000002,Vente,40000,71,,ERAULCOURT,B041,02250,02039,Autremencourt,02,,,02039000ZH0033,,,,,,,,,,,,,0,1,Maison,88,6,S,sols,,,595,3.811194,49.711262
2019-19130,2019-12-23,000002,Vente,40000,,,ERAULCOURT,B041,02250,02039,Autremencourt,02,,,02039000ZH0036,,,,,,,,,,,,,0,,,,,T,terres,,,97,3.811261,49.711103
