id_mutation,date_mutation,numero_disposition,nature_mutation,valeur_fonciere,adresse_numero,adresse_suffixe,adresse_nom_voie,adresse_code_voie,code_postal,code_commune,nom_commune,code_departement,ancien_code_commune,ancien_nom_commune,id_parcelle,ancien_id_parcelle,numero_volume,lot1_numero,lot1_surface_carrez,lot2_numero,lot2_surface_carrez,lot3_numero,lot3_surface_carrez,lot4_numero,lot4_surface_carrez,lot5_numero,lot5_surface_carrez,nombre_lots,code_type_local,type_local,surface_reelle_bati,nombre_pieces_principales,code_nature_culture,nature_culture,code_nature_culture_speciale,nature_culture_speciale,surface_terrain,longitude,latitude
2019-16435,2019-02-12,000001,Vente,65000,9002,,LE CHEMIN DE LA PECHERIE E,B008,02190,02073,Berry-au-Bac,02,,,020730000V0109,,,,,,,,,,,,,0,3,Dépendance,,0,S,sols,,,10,3.881601,49.407331
2019-16435,2019-02-12,000001,Vente,65000,9002,,LE CHEMIN DE LA PECHERIE E,B008,02190,02073,Berry-au-Bac,02,,,020730000V0109,,,,,,,,,,,,,0,3,Dépendance,,0,AG,terrains d'agrément,,,26831,3.881601,49.407331
2019-16683,2019-03-04,000001,Vente,15000,223,,LE PETIT PAVE,B032,02190,02073,Berry-au-Bac,02,,,020730000W0099,,,,,,,,,,,,,0,3,Dépendance,,0,J,jardins,,,1065,3.906668,49.404543
2019-16705,2019-03-12,000001,Vente,65000,,,LA MONTAGNE DE GERNICOURT,B028,02190,02073,Berry-au-Bac,02,,,02073000AC0223,,,,,,,,,,,,,0,,,,,J,jardins,,,172,3.903001,49.395248
2019-16705,2019-03-12,000001,Vente,65000,,,LA MONTAGNE DE GERNICOURT,B028,02190,02073,Berry-au-Bac,02,,,02073000AC0283,,,,,,,,,,,,,0,,,,,AB,terrains a bâtir,,,628,3.902903,49.395243
2019-17443,2019-07-04,000001,Vente,5000,,,LE PETIT PAVE,B032,02190,02073,Berry-au-Bac,02,,,020730000W0093,,,,,,,,,,,,,0,,,,,AG,terrains d'agrément,,,775,3.905683,49.4041
2019-17797,2019-07-15,000001,Vente,40000,22,,RUE DU COLONEL VERGEZAC,0014,02190,02073,Berry-au-Bac,02,,,02073000AC0080,,,,,,,,,,,,,0,1,Maison,64,3,S,sols,,,748,3.903106,49.39551
2019-18120,2019-09-09,000001,Vente,65000,,,LA MONTAGNE DE GERNICOURT,B028,02190,02073,Berry-au-Bac,02,,,02073000AC0282,,,,,,,,,,,,,0,,,,,AB,terrains a bâtir,,,725,3.902894,49.395062
2019-18384,2019-10-17,000001,Vente,235000,3,,RUE DU GENERAL ESTIENNE,0040,02190,02073,Berry-au-Bac,02,,,02073000AB0012,,,,,,,,,,,,,0,1,Maison,110,5,S,sols,,,580,3.898976,49.404425
2019-18384,2019-10-17,000001,Vente,235000,,,LE VILLAGE,B048,02190,02073,Berry-au-Bac,02,,,02073000AB0262,,,,,,,,,,,,,0,,,,,S,sols,,,121,3.898706,49.404625
2019-18384,2019-10-17,000001,Vente,235000,,,LE VILLAGE,B048,02190,02073,Berry-au-Bac,02,,,02073000AB0265,,,,,,,,,,,,,0,,,,,S,sols,,,732,3.898826,49.404703
