id_mutation,date_mutation,numero_disposition,nature_mutation,valeur_fonciere,adresse_numero,adresse_suffixe,adresse_nom_voie,adresse_code_voie,code_postal,code_commune,nom_commune,code_departement,ancien_code_commune,ancien_nom_commune,id_parcelle,ancien_id_parcelle,numero_volume,lot1_numero,lot1_surface_carrez,lot2_numero,lot2_surface_carrez,lot3_numero,lot3_surface_carrez,lot4_numero,lot4_surface_carrez,lot5_numero,lot5_surface_carrez,nombre_lots,code_type_local,type_local,surface_reelle_bati,nombre_pieces_principales,code_nature_culture,nature_culture,code_nature_culture_speciale,nature_culture_speciale,surface_terrain,longitude,latitude
2019-19257,2019-01-16,000001,Vente,75000,5000,,RUE ROBESPIERRE,0094,02100,02355,Gricourt,02,,,02355000ZP0018,,,14,81.83,,,,,,,,,1,1,Maison,81,4,,,,,,3.247125,49.884653
2019-19396,2019-02-13,000001,Vente,90000,8,,RUE ROBESPIERRE,0094,02100,02355,Gricourt,02,,,02355000ZP0018,,,41,75.94,,,,,,,,,1,1,Maison,82,4,,,,,,3.247125,49.884653
2019-19447,2019-02-23,000001,Vente,350000,,,RUE JEAN JAURES,0050,02100,02355,Gricourt,02,,,023550000B0936,,,,,,,,,,,,,0,,,,,J,jardins,,,308,3.243025,49.888174
2019-19447,2019-02-23,000001,Vente,350000,,,RUE JEAN JAURES,0050,02100,02355,Gricourt,02,,,023550000B0936,,,,,,,,,,,,,0,,,,,S,sols,,,154,3.243025,49.888174
2019-19447,2019-02-23,000001,Vente,350000,,,RUE JEAN JAURES,0050,02100,02355,Gricourt,02,,,023550000B0939,,,,,,,,,,,,,0,,,,,S,sols,,,99,3.243466,49.888198
2019-19447,2019-02-23,000001,Vente,350000,3,B,RUE ALPHONSE DAUDET,0003,02100,02355,Gricourt,02,,,023550000B0941,,,,,,,,,,,,,0,1,Maison,166,6,S,sols,,,1184,3.243408,49.888307
2019-19508,2019-03-09,000001,Vente terrain à bâtir,37500,,,LES CHAMPS DE PARCAGE OUES,B049,02100,02355,Gricourt,02,,,02355000ZL0125,,,,,,,,,,,,,0,,,,,AB,terrains a bâtir,,,537,3.241262,49.893152
2019-19587,2019-03-20,000002,Vente,316000,,,LE VILLAGE,B047,02100,02355,Gricourt,02,,,023550000B0412,,,,,,,,,,,,,0,,,,,S,sols,,,607,3.241946,49.887628
2019-19587,2019-03-20,000002,Vente,316000,,,LE VILLAGE,B047,02100,02355,Gricourt,02,,,023550000B0414,,,,,,,,,,,,,0,,,,,AG,terrains d'agrément,,,13043,3.241232,49.886911
2019-19587,2019-03-20,000002,Vente,316000,,,LE VILLAGE,B047,02100,02355,Gricourt,02,,,023550000B0414,,,,,,,,,,,,,0,,,,,S,sols,,,980,3.241232,49.886911
2019-19587,2019-03-20,000002,Vente,316000,,,LE VILLAGE,B047,02100,02355,Gricourt,02,,,023550000B0414,,,,,,,,,,,,,0,,,,,PA,pâtures,,,6522,3.241232,49.886911
2019-19587,2019-03-20,000002,Vente,316000,,,LE VILLAGE,B047,02100,02355,Gricourt,02,,,023550000B0771,,,,,,,,,,,,,0,,,,,S,sols,,,1859,3.241139,49.887643
2019-19587,2019-03-20,000002,Vente,316000,5001,,PL JULES FERRY,0057,02100,02355,Gricourt,02,,,023550000B0772,,,,,,,,,,,,,0,4,Local industriel. commercial ou assimilé,126,0,S,sols,,,1856,3.241558,49.887839
2019-19587,2019-03-20,000002,Vente,316000,,,LE VILLAGE,B047,02100,02355,Gricourt,02,,,023550000B0960,,,,,,,,,,,,,0,,,,,PA,pâtures,,,2902,3.242602,49.887343
2019-19587,2019-03-20,000002,Vente,316000,,,LE VILLAGE,B047,02100,02355,Gricourt,02,,,023550000B0961,,,,,,,,,,,,,0,,,,,PA,pâtures,,,879,3.242256,49.887827
2019-19730,2019-04-24,000001,Vente,127000,12,,RUE JOLIOT CURIE,0054,02100,02355,Gricourt,02,,,02355000ZN0049,,,,,,,,,,,,,0,1,Maison,83,5,S,sols,,,287,3.248707,49.886641
2019-19730,2019-04-24,000001,Vente,127000,,,VALLEE GUILLAUME,B044,02100,02355,Gricourt,02,,,02355000ZN0100,,,,,,,,,,,,,0,,,,,J,jardins,,,554,3.249244,49.88678
2019-19933,2019-05-23,000001,Vente terrain à bâtir,38500,,,LES CHAMPS DE PARCAGE OUES,B049,02100,02355,Gricourt,02,,,02355000ZL0131,,,,,,,,,,,,,0,,,,,AB,terrains a bâtir,,,573,3.242475,49.892481
2019-19938,2019-06-08,000001,Vente,104000,16,,RUE JOLIOT CURIE,0054,02100,02355,Gricourt,02,,,02355000ZN0047,,,,,,,,,,,,,0,,,,,S,sols,,,287,3.248591,49.886804
2019-19938,2019-06-08,000001,Vente,104000,,,VALLEE GUILLAUME,B044,02100,02355,Gricourt,02,,,02355000ZN0098,,,,,,,,,,,,,0,,,,,J,jardins,,,554,3.249186,49.88696
2019-20207,2019-06-29,000001,Vente,82000,5000,,RUE ROBESPIERRE,0094,02100,02355,Gricourt,02,,,02355000ZP0018,,,8,,,,,,,,,,1,1,Maison,81,4,,,,,,3.247125,49.884653
2019-20281,2019-07-17,000001,Vente terrain à bâtir,42500,,,LES CHAMPS DE PARCAGE OUES,B049,02100,02355,Gricourt,02,,,02355000ZL0138,,,,,,,,,,,,,0,,,,,AB,terrains a bâtir,,,607,3.241022,49.892271
2019-20373,2019-07-31,000001,Vente terrain à bâtir,43000,,,LES CHAMPS DE PARCAGE OUES,B049,02100,02355,Gricourt,02,,,02355000ZL0135,,,,,,,,,,,,,0,,,,,AB,terrains a bâtir,,,608,3.241559,49.891792
2019-20425,2019-08-01,000001,Vente,87200,5000,,RUE ROBESPIERRE,0094,02100,02355,Gricourt,02,,,02355000ZP0018,,,24,82.74,,,,,,,,,1,1,Maison,81,4,,,,,,3.247125,49.884653
2019-20523,2019-09-12,000001,Vente,160000,32,,RUE GEORGES TROCME,0045,02100,02355,Gricourt,02,,,02355000ZL0040,,,,,,,,,,,,,0,1,Maison,80,4,S,sols,,,739,3.238607,49.892773
2019-20699,2019-10-04,000001,Vente,82000,5000,,RUE ROBESPIERRE,0094,02100,02355,Gricourt,02,,,02355000ZP0018,,,6,82.85,,,,,,,,,1,1,Maison,81,4,,,,,,3.247125,49.884653
2019-20727,2019-09-13,000001,Vente terrain à bâtir,41500,,,LES CHAMPS DE PARCAGE OUES,B049,02100,02355,Gricourt,02,,,02355000ZL0145,,,,,,,,,,,,,0,,,,,AB,terrains a bâtir,,,588,3.241568,49.892721
2019-20842,2019-10-04,000001,Vente terrain à bâtir,43500,,,LES CHAMPS DE PARCAGE OUES,B049,02100,02355,Gricourt,02,,,02355000ZL0143,,,,,,,,,,,,,0,,,,,AB,terrains a bâtir,,,614,3.24199,49.892395
2019-20848,2019-10-29,000001,Vente,199000,5,,RUE GEORGES TROCME,0045,02100,02355,Gricourt,02,,,02355000ZL0059,,,,,,,,,,,,,0,1,Maison,91,4,S,sols,,,814,3.23974,49.891584
2019-20993,2019-11-12,000001,Vente,90500,8,,RUE ROBESPIERRE,0094,02100,02355,Gricourt,02,,,02355000ZP0018,,,12,83.37,,,,,,,,,1,1,Maison,81,4,,,,,,3.247125,49.884653
2019-20995,2019-10-31,000001,Vente,201000,10,,RUE GEORGES TROCME,0045,02100,02355,Gricourt,02,,,02355000ZL0029,,,,,,,,,,,,,0,1,Maison,110,6,S,sols,,,730,3.239171,49.891662
2019-21025,2019-11-08,000001,Vente terrain à bâtir,36500,,,LES CHAMPS DE PARCAGE OUES,B049,02100,02355,Gricourt,02,,,02355000ZL0139,,,,,,,,,,,,,0,,,,,AB,terrains a bâtir,,,511,3.240818,49.892425
2019-21102,2019-11-16,000001,Vente,59000,,,LE VILLAGE,B047,02100,02355,Gricourt,02,,,023550000B0357,,,,,,,,,,,,,0,,,,,AB,terrains a bâtir,,,937,3.244741,49.886414
2019-21102,2019-11-16,000001,Vente,59000,,,LE VILLAGE,B047,02100,02355,Gricourt,02,,,023550000B0834,,,,,,,,,,,,,0,,,,,BT,taillis simples,,,722,3.244379,49.886248
2019-21131,2019-12-04,000001,Vente,144000,9,,RUE GEORGES TROCME,0045,02100,02355,Gricourt,02,,,02355000ZL0057,,,,,,,,,,,,,0,1,Maison,138,6,S,sols,,,503,3.239488,49.891872
2019-21151,2019-11-28,000001,Vente,170000,13,,RUE GEORGES TROCME,0045,02100,02355,Gricourt,02,,,02355000ZL0055,,,,,,,,,,,,,0,1,Maison,105,5,S,sols,,,854,3.240115,49.892201
2019-21276,2019-12-18,000001,Vente terrain à bâtir,37500,,,LES CHAMPS DE PARCAGE OUES,B049,02100,02355,Gricourt,02,,,02355000ZL0128,,,,,,,,,,,,,0,,,,,AB,terrains a bâtir,,,542,3.241914,49.89294
