id_mutation,date_mutation,numero_disposition,nature_mutation,valeur_fonciere,adresse_numero,adresse_suffixe,adresse_nom_voie,adresse_code_voie,code_postal,code_commune,nom_commune,code_departement,ancien_code_commune,ancien_nom_commune,id_parcelle,ancien_id_parcelle,numero_volume,lot1_numero,lot1_surface_carrez,lot2_numero,lot2_surface_carrez,lot3_numero,lot3_surface_carrez,lot4_numero,lot4_surface_carrez,lot5_numero,lot5_surface_carrez,nombre_lots,code_type_local,type_local,surface_reelle_bati,nombre_pieces_principales,code_nature_culture,nature_culture,code_nature_culture_speciale,nature_culture_speciale,surface_terrain,longitude,latitude
2019-23297,2019-01-18,000001,Vente,52000,,,LE LOUDIER,B028,02500,02544,Neuve-Maison,02,,,025440000A0322,,,,,,,,,,,,,0,,,,,J,jardins,,,305,4.03446,49.939422
2019-23297,2019-01-18,000001,Vente,52000,1,,RUE ROGER HOUDELETTE,0053,02500,02544,Neuve-Maison,02,,,025440000A0323,,,,,,,,,,,,,0,1,Maison,75,3,S,sols,,,340,4.034414,49.939595
2019-23297,2019-01-18,000001,Vente,52000,1,,RUE ROGER HOUDELETTE,0053,02500,02544,Neuve-Maison,02,,,025440000A0323,,,,,,,,,,,,,0,4,Local industriel. commercial ou assimilé,30,0,S,sols,,,340,4.034414,49.939595
2019-23297,2019-01-18,000001,Vente,52000,,,LE LOUDIER,B028,02500,02544,Neuve-Maison,02,,,025440000A1154,,,,,,,,,,,,,0,,,,,PA,pâtures,,,1537,4.034291,49.939448
2019-23332,2019-01-22,000001,Vente,20000,,,LA NOIX,B033,02500,02544,Neuve-Maison,02,,,025440000B0303,,,,,,,,,,,,,0,,,,,PA,pâtures,,,7570,4.050844,49.921686
2019-23332,2019-01-22,000001,Vente,20000,,,PRE SAINTE CATHERINE,B046,02500,02544,Neuve-Maison,02,,,025440000B0313,,,,,,,,,,,,,0,,,,,L,landes,,,10577,4.047623,49.924026
2019-23332,2019-01-22,000001,Vente,20000,,,PRE SAINTE CATHERINE,B046,02500,02544,Neuve-Maison,02,,,025440000B0316,,,,,,,,,,,,,0,,,,,J,jardins,,,680,4.05064,49.923225
2019-23332,2019-01-22,000001,Vente,20000,,,PRE SAINTE CATHERINE,B046,02500,02544,Neuve-Maison,02,,,025440000B0325,,,,,,,,,,,,,0,,,,,PA,pâtures,,,2230,4.047925,49.923467
2019-23332,2019-01-22,000001,Vente,20000,,,PRE SAINTE CATHERINE,B046,02500,02544,Neuve-Maison,02,,,025440000B0331,,,,,,,,,,,,,0,,,,,PA,pâtures,,,1050,4.047312,49.923788
2019-23332,2019-01-22,000001,Vente,20000,,,PRE SAINTE CATHERINE,B046,02500,02544,Neuve-Maison,02,,,025440000B0332,,,,,,,,,,,,,0,,,,,PA,pâtures,,,590,4.046822,49.924062
2019-23332,2019-01-22,000001,Vente,20000,,,PRE SAINTE CATHERINE,B046,02500,02544,Neuve-Maison,02,,,025440000B0333,,,,,,,,,,,,,0,,,,,PA,pâtures,,,1110,4.04632,49.924278
2019-23332,2019-01-22,000001,Vente,20000,,,LA NOIX,B033,02500,02544,Neuve-Maison,02,,,025440000B0350,,,,,,,,,,,,,0,,,,,PA,pâtures,,,1567,4.050919,49.920683
2019-23332,2019-01-22,000001,Vente,20000,,,LA NOIX,B033,02500,02544,Neuve-Maison,02,,,025440000B0373,,,,,,,,,,,,,0,,,,,PA,pâtures,,,11009,4.051493,49.920978
2019-23340,2019-01-15,000001,Vente,13000,6,B,CHE DES ILOTS,0023,02500,02544,Neuve-Maison,02,,,025440000A1204,,,,,,,,,,,,,0,1,Maison,31,3,VE,vergers,,,274,4.030564,49.939115
2019-23340,2019-01-15,000001,Vente,13000,,,LE LOUDIER,B028,02500,02544,Neuve-Maison,02,,,025440000A1207,,,,,,,,,,,,,0,,,,,VE,vergers,,,5216,4.031145,49.939225
2019-23469,2019-03-13,000001,Vente,67960,4,,RUE CHARLES MOGLIA,0009,02500,02544,Neuve-Maison,02,,,025440000A0825,,,,,,,,,,,,,0,1,Maison,70,3,S,sols,,,250,4.031622,49.930117
2019-23550,2019-04-12,000002,Vente,250,,,LE VILLAGE,B054,02500,02544,Neuve-Maison,02,,,025440000A1655,,,,,,,,,,,,,0,,,,,S,sols,,,54,4.031875,49.930121
2019-23857,2019-07-22,000001,Vente,80000,,,LE LOUDIER,B028,02500,02544,Neuve-Maison,02,,,025440000A1345,,,,,,,,,,,,,0,,,,,J,jardins,,,510,4.032273,49.93849
2019-23857,2019-07-22,000001,Vente,80000,1,,CHE DES ILOTS,0023,02500,02544,Neuve-Maison,02,,,025440000A1346,,,,,,,,,,,,,0,1,Maison,70,3,S,sols,,,392,4.032283,49.938635
2019-23899,2019-08-02,000001,Vente,109250,,,LE VILLAGE,B054,02500,02544,Neuve-Maison,02,,,025440000A0949,,,,,,,,,,,,,0,,,,,PA,pâtures,,,1195,4.035259,49.927652
2019-23899,2019-08-02,000001,Vente,109250,,,LE VILLAGE,B054,02500,02544,Neuve-Maison,02,,,025440000A0953,,,,,,,,,,,,,0,,,,,J,jardins,,,500,4.034837,49.927618
2019-23899,2019-08-02,000001,Vente,109250,19,,RUE HUILLET,0027,02500,02544,Neuve-Maison,02,,,025440000A0954,,,,,,,,,,,,,0,1,Maison,84,3,S,sols,,,506,4.034583,49.927632
2019-24217,2019-11-13,000001,Vente,19361,,,LE MOULIN HUSSON,B032,02500,02544,Neuve-Maison,02,,,025440000A0134,,,,,,,,,,,,,0,,,,,PA,pâtures,,,8650,4.045151,49.943582
2019-24217,2019-11-13,000001,Vente,19361,,,LA GRANDE BANSIERE,B023,02500,02544,Neuve-Maison,02,,,025440000A0135,,,,,,,,,,,,,0,,,,,PA,pâtures,,,10080,4.045257,49.94262
2019-24217,2019-11-13,000001,Vente,19361,,,LA GRANDE BANSIERE,B023,02500,02544,Neuve-Maison,02,,,025440000A0136,,,,,,,,,,,,,0,,,,,PA,pâtures,,,4680,4.043947,49.943044
2019-24217,2019-11-13,000001,Vente,19361,,,LA GRANDE BANSIERE,B023,02500,02544,Neuve-Maison,02,,,025440000A0137,,,,,,,,,,,,,0,,,,,PA,pâtures,,,11570,4.044,49.942162
2019-24217,2019-11-13,000001,Vente,19361,,,LE TROU THIERACHE,B052,02500,02544,Neuve-Maison,02,,,025440000A0146,,,,,,,,,,,,,0,,,,,PA,pâtures,,,4315,4.040442,49.94178
2019-24217,2019-11-13,000001,Vente,19361,,,LE TROU THIERACHE,B052,02500,02544,Neuve-Maison,02,,,025440000A0148,,,,,,,,,,,,,0,,,,,PA,pâtures,,,1710,4.040824,49.940903
2019-24217,2019-11-13,000001,Vente,19361,,,LES GRANDES AUNES,B026,02500,02544,Neuve-Maison,02,,,025440000A0418,,,,,,,,,,,,,0,,,,,PA,pâtures,,,6200,4.04962,49.943276
2019-24353,2019-12-11,000001,Vente,145170,,,LE VILLAGE,B054,02500,02544,Neuve-Maison,02,,,025440000A0966,,,,,,,,,,,,,0,,,,,PA,pâtures,,,557,4.032567,49.928141
2019-24353,2019-12-11,000001,Vente,145170,,,LE VILLAGE,B054,02500,02544,Neuve-Maison,02,,,025440000A0967,,,,,,,,,,,,,0,,,,,J,jardins,,,426,4.032275,49.928108
2019-24353,2019-12-11,000001,Vente,145170,2,,RUE ENGUERRAND DE COUCY,0015,02500,02544,Neuve-Maison,02,,,025440000A0968,,,,,,,,,,,,,0,1,Maison,91,4,S,sols,,,491,4.032256,49.928243
