id_mutation,date_mutation,numero_disposition,nature_mutation,valeur_fonciere,adresse_numero,adresse_suffixe,adresse_nom_voie,adresse_code_voie,code_postal,code_commune,nom_commune,code_departement,ancien_code_commune,ancien_nom_commune,id_parcelle,ancien_id_parcelle,numero_volume,lot1_numero,lot1_surface_carrez,lot2_numero,lot2_surface_carrez,lot3_numero,lot3_surface_carrez,lot4_numero,lot4_surface_carrez,lot5_numero,lot5_surface_carrez,nombre_lots,code_type_local,type_local,surface_reelle_bati,nombre_pieces_principales,code_nature_culture,nature_culture,code_nature_culture_speciale,nature_culture_speciale,surface_terrain,longitude,latitude
2019-19200,2019-01-25,000001,Vente,84956.48,,,LA GLORIETTE,B010,02100,02659,Rouvroy,02,,,02659000AB0024,,,,,,,,,,,,,0,,,,,T,terres,,,8300,3.330658,49.865104
2019-19200,2019-01-25,000001,Vente,84956.48,,,LA GLORIETTE,B010,02100,02659,Rouvroy,02,,,02659000AB0024,,,,,,,,,,,,,0,,,,,S,sols,,,2564,3.330658,49.865104
2019-19528,2019-03-14,000001,Vente,80000,,,LE PARC,B025,02100,02659,Rouvroy,02,,,02659000AE0033,,,,,,,,,,,,,0,,,,,E,eaux,ETANG,Etangs,1933,3.315097,49.852132
2019-19528,2019-03-14,000001,Vente,80000,,,LE PARC,B025,02100,02659,Rouvroy,02,,,02659000AE0034,,,,,,,,,,,,,0,,,,,J,jardins,,,2610,3.31543,49.852081
2019-19528,2019-03-14,000001,Vente,80000,,,LE PARC,B025,02100,02659,Rouvroy,02,,,02659000AE0035,,,,,,,,,,,,,0,,,,,E,eaux,ETANG,Etangs,5313,3.31566,49.852002
2019-19528,2019-03-14,000001,Vente,80000,,,LE PARC,B025,02100,02659,Rouvroy,02,,,02659000AE0036,,,,,,,,,,,,,0,,,,,S,sols,,,290,3.315854,49.852023
2019-19528,2019-03-14,000001,Vente,80000,36,,RUE GABRIEL LAGUILLIEZ,0022,02100,02659,Rouvroy,02,,,02659000AE0037,,,,,,,,,,,,,0,1,Maison,85,4,S,sols,,,783,3.316118,49.851846
2019-19573,2019-03-16,000001,Vente,140000,5004,B,AV ABEL BARDIN ET CH BENOIT,0001,02100,02659,Rouvroy,02,,,02659000AB0036,,,,,,,,,,,,,0,4,Local industriel. commercial ou assimilé,470,0,S,sols,,,1342,3.327732,49.867706
2019-19573,2019-03-16,000001,Vente,140000,,,ZI ZONE INDUSTRIELLE,A001,02100,02659,Rouvroy,02,,,02659000AB0037,,,,,,,,,,,,,0,,,,,S,sols,,,807,3.327631,49.867627
2019-19866,2019-05-04,000001,Vente,135000,31,,RUE LOUIS PLANCHON,0027,02100,02659,Rouvroy,02,,,02659000AD0013,,,,,,,,,,,,,0,1,Maison,54,3,S,sols,,,425,3.318345,49.856698
2019-20608,2019-09-06,000001,Vente,154000,1,,RUE DES BOSQUETS,0005,02100,02659,Rouvroy,02,,,02659000AD0116,,,,,,,,,,,,,0,4,Local industriel. commercial ou assimilé,,0,S,sols,,,698,3.320312,49.855092
2019-20608,2019-09-06,000001,Vente,154000,1,,RUE DES BOSQUETS,0005,02100,02659,Rouvroy,02,,,02659000AD0116,,,,,,,,,,,,,0,1,Maison,125,6,S,sols,,,698,3.320312,49.855092
2019-20944,2019-10-25,000001,Vente,47949.87,6,B,AV ERIC JAULMES,0015,02100,02659,Rouvroy,02,,,02659000AD0253,,,,,,,,,,,,,0,1,Maison,99,5,S,sols,,,819,3.320051,49.856621
2019-21190,2019-11-28,000001,Vente,92000,14,,RUE DES PRES,0050,02100,02659,Rouvroy,02,,,02659000AD0109,,,,,,,,,,,,,0,1,Maison,93,5,S,sols,,,497,3.320534,49.855583
