id_mutation,date_mutation,numero_disposition,nature_mutation,valeur_fonciere,adresse_numero,adresse_suffixe,adresse_nom_voie,adresse_code_voie,code_postal,code_commune,nom_commune,code_departement,ancien_code_commune,ancien_nom_commune,id_parcelle,ancien_id_parcelle,numero_volume,lot1_numero,lot1_surface_carrez,lot2_numero,lot2_surface_carrez,lot3_numero,lot3_surface_carrez,lot4_numero,lot4_surface_carrez,lot5_numero,lot5_surface_carrez,nombre_lots,code_type_local,type_local,surface_reelle_bati,nombre_pieces_principales,code_nature_culture,nature_culture,code_nature_culture_speciale,nature_culture_speciale,surface_terrain,longitude,latitude
2019-21448,2019-01-11,000001,Vente,197500,,,LE VILLAGE,B034,02600,02734,Taillefontaine,02,,,02734000AB0294,,,,,,,,,,,,,0,,,,,J,jardins,,,187,3.041414,49.310134
2019-21448,2019-01-11,000001,Vente,197500,8,,CHE DES RUELLES,0050,02600,02734,Taillefontaine,02,,,02734000AB0295,,,,,,,,,,,,,0,1,Maison,93,3,S,sols,,,444,3.041762,49.31023
2019-21448,2019-01-11,000001,Vente,197500,,,LA TABLE DIEU,B030,02600,02734,Taillefontaine,02,,,02734000ZE0033,,,,,,,,,,,,,0,,,,,J,jardins,,,580,3.041767,49.310095
2019-22002,2019-05-03,000001,Vente,159000,38,,RTE DE COMPIEGNE,0015,02600,02734,Taillefontaine,02,,,02734000AB0170,,,2,,,,,,,,,,1,3,Dépendance,,0,,,,,,3.041517,49.312282
2019-22002,2019-05-03,000001,Vente,159000,,,LE VILLAGE,B034,02600,02734,Taillefontaine,02,,,02734000AB0172,,,,,,,,,,,,,0,,,,,J,jardins,,,290,3.041632,49.312082
2019-22002,2019-05-03,000001,Vente,159000,36,,RTE DE COMPIEGNE,0015,02600,02734,Taillefontaine,02,,,02734000AB0173,,,,,,,,,,,,,0,1,Maison,100,3,S,sols,,,317,3.041761,49.312222
2019-22002,2019-05-03,000001,Vente,159000,,,LE VILLAGE,B034,02600,02734,Taillefontaine,02,,,02734000AB0389,,,,,,,,,,,,,0,,,,,S,sols,,,45,3.041692,49.312277
2019-22183,2019-05-29,000001,Vente,42500,28,,RTE DE COMPIEGNE,0015,02600,02734,Taillefontaine,02,,,02734000AB0151,,,1,,,,,,,,,,1,1,Maison,63,2,,,,,,3.04296,49.3124
2019-22184,2019-05-28,000001,Vente,360000,3,,RUE D EN HAUT,0025,02600,02734,Taillefontaine,02,,,02734000AB0244,,,,,,,,,,,,,0,1,Maison,212,8,S,sols,,,698,3.042913,49.311029
2019-22184,2019-05-28,000001,Vente,360000,,,LE VILLAGE,B034,02600,02734,Taillefontaine,02,,,02734000AB0425,,,,,,,,,,,,,0,,,,,J,jardins,,,147,3.043343,49.311117
2019-22184,2019-05-28,000001,Vente,360000,,,LE VILLAGE,B034,02600,02734,Taillefontaine,02,,,02734000AB0455,,,,,,,,,,,,,0,,,,,S,sols,,,750,3.043143,49.311047
2019-22228,2019-06-13,000001,Vente,240000,,,LE VILLAGE,B034,02600,02734,Taillefontaine,02,,,02734000AB0178,,,,,,,,,,,,,0,,,,,J,jardins,,,843,3.04137,49.312979
2019-22228,2019-06-13,000001,Vente,240000,2,,CHE DE THIMET,0055,02600,02734,Taillefontaine,02,,,02734000AB0179,,,,,,,,,,,,,0,1,Maison,220,5,S,sols,,,490,3.041687,49.312912
2019-22228,2019-06-13,000001,Vente,240000,,,LE VILLAGE,B034,02600,02734,Taillefontaine,02,,,02734000AB0405,,,,,,,,,,,,,0,,,,,J,jardins,,,619,3.04198,49.312872
2019-22613,2019-09-06,000001,Vente,5000,,,LE CHAMP DOLLANT,B002,02600,02734,Taillefontaine,02,,,02734000ZB0046,,,,,,,,,,,,,0,,,,,BT,taillis simples,,,6940,3.054535,49.327168
2019-22856,2019-11-14,000001,Vente,2625,,,LES VIGNETTES,B033,02600,02734,Taillefontaine,02,,,02734000ZA0008,,,,,,,,,,,,,0,,,,,T,terres,,,1050,3.040526,49.315572
2019-23095,2019-12-09,000001,Vente,14000,,,MARIVAL,B018,02600,02734,Taillefontaine,02,,,02734000ZD0059,,,,,,,,,,,,,0,,,,,AG,terrains d'agrément,,,1469,3.066776,49.321539
