id_mutation,date_mutation,numero_disposition,nature_mutation,valeur_fonciere,adresse_numero,adresse_suffixe,adresse_nom_voie,adresse_code_voie,code_postal,code_commune,nom_commune,code_departement,ancien_code_commune,ancien_nom_commune,id_parcelle,ancien_id_parcelle,numero_volume,lot1_numero,lot1_surface_carrez,lot2_numero,lot2_surface_carrez,lot3_numero,lot3_surface_carrez,lot4_numero,lot4_surface_carrez,lot5_numero,lot5_surface_carrez,nombre_lots,code_type_local,type_local,surface_reelle_bati,nombre_pieces_principales,code_nature_culture,nature_culture,code_nature_culture_speciale,nature_culture_speciale,surface_terrain,longitude,latitude
2019-34007,2019-01-04,000001,Vente,165000,1,,PL PAUL ARENE,0117,04190,04116,Les Mées,04,,,041160000C1363,,,,,,,,,,,,,0,1,Maison,80,4,S,sols,,,712,5.966031,44.027798
2019-34031,2019-01-04,000002,Vente,1,,,LES PRADAS,B115,04190,04116,Les Mées,04,,,041160000A2159,,,,,,,,,,,,,0,,,,,AB,terrains a bâtir,,,134,,
2019-34031,2019-01-04,000002,Vente,1,,,LES PRADAS,B115,04190,04116,Les Mées,04,,,041160000A2161,,,,,,,,,,,,,0,,,,,P,prés,,,10,,
2019-34170,2019-01-18,000001,Vente,10000,,,GRATTE CONIL,B058,04190,04116,Les Mées,04,,,041160000D0014,,,,,,,,,,,,,0,,,,,BT,taillis simples,,,3040,5.948976,43.980487
2019-34170,2019-01-18,000001,Vente,10000,,,GRATTE CONIL,B058,04190,04116,Les Mées,04,,,041160000D0015,,,,,,,,,,,,,0,,,,,VE,vergers,OLIVE,Oliveraie ou oliviers,1750,5.94808,43.980673
2019-34275,2019-01-31,000001,Vente,76700,35,,RUE FONT NEUVE,0065,04190,04116,Les Mées,04,,,041160000G0330,,,,,,,,,,,,,0,1,Maison,31,1,S,sols,,,31,5.975362,44.028048
2019-34287,2019-01-23,000001,Vente,25000,5149,,LA BASTIDE BLANCHE,B010,04190,04116,Les Mées,04,,,041160000E0232,,,5,110,,,,,,,,,1,2,Appartement,132,5,,,,,,5.925119,43.971239
2019-34287,2019-01-23,000001,Vente,25000,5149,,LA BASTIDE BLANCHE,B010,04190,04116,Les Mées,04,,,041160000E0232,,,6,,,,,,,,,,1,2,Appartement,138,4,,,,,,5.925119,43.971239
2019-34287,2019-01-23,000001,Vente,25000,5149,,LA BASTIDE BLANCHE,B010,04190,04116,Les Mées,04,,,041160000E0232,,,1,,,,,,,,,,1,3,Dépendance,,0,,,,,,5.925119,43.971239
2019-34318,2019-01-25,000001,Vente,190000,7265,,LES PRADAS,B115,04190,04116,Les Mées,04,,,041160000A1569,,,,,,,,,,,,,0,2,Appartement,75,4,S,sols,,,724,,
2019-34318,2019-01-25,000001,Vente,190000,7265,,LES PRADAS,B115,04190,04116,Les Mées,04,,,041160000A1569,,,,,,,,,,,,,0,2,Appartement,80,4,S,sols,,,724,,
2019-34322,2019-02-06,000001,Vente,200000,5003,,LES VARZELLES,B148,04190,04116,Les Mées,04,,,041160000A0055,,,,,,,,,,,,,0,1,Maison,89,3,S,sols,,,60,5.998598,44.044843
2019-34322,2019-02-06,000001,Vente,200000,,,LES VARZELLES,B148,04190,04116,Les Mées,04,,,041160000A0056,,,,,,,,,,,,,0,,,,,S,sols,,,180,5.998337,44.044913
2019-34322,2019-02-06,000001,Vente,200000,,,LES VARZELLES,B148,04190,04116,Les Mées,04,,,041160000A0056,,,,,,,,,,,,,0,,,,,T,terres,,,4855,5.998337,44.044913
2019-34361,2019-02-01,000001,Vente,300,,,LA COMBE,B033,04190,04116,Les Mées,04,,,041160000B0342,,,,,,,,,,,,,0,,,,,L,landes,VAGUE,Terrain vague,6650,5.99151,44.02944
2019-34361,2019-02-01,000001,Vente,300,,,TRABUQUETTE,B143,04190,04116,Les Mées,04,,,041160000C0753,,,,,,,,,,,,,0,,,,,BT,taillis simples,,,970,5.967563,44.008564
2019-34363,2019-02-04,000001,Vente,244000,7600,,ALL DE LA CROIX,0044,04190,04116,Les Mées,04,,,041160000A2045,,,,,,,,,,,,,0,1,Maison,136,5,S,sols,,,700,,
2019-34366,2019-02-04,000001,Vente,64500,,,SAINT PIERRE,B132,04190,04116,Les Mées,04,,,041160000C0801,,,,,,,,,,,,,0,,,,,VE,vergers,OLIVE,Oliveraie ou oliviers,11780,5.96126,44.012714
2019-34391,2019-02-05,000001,Vente,216300,,,RESERVE DE LA TABIACE,B124,04190,04116,Les Mées,04,,,041160000F1869,,,,,,,,,,,,,0,,,,,T,terres,,,1150,5.927136,43.985321
2019-34391,2019-02-05,000001,Vente,216300,5226,,RESERVE DE LA TABIACE,B124,04190,04116,Les Mées,04,,,041160000F1870,,,,,,,,,,,,,0,1,Maison,83,4,S,sols,,,1165,5.927075,43.985062
2019-34428,2019-02-21,000001,Vente,20000,,,L ARMADE,B003,04190,04116,Les Mées,04,,,041160000B0618,,,,,,,,,,,,,0,,,,,L,landes,VAGUE,Terrain vague,2950,6.013384,44.043753
2019-34428,2019-02-21,000001,Vente,20000,,,L ARMADE,B003,04190,04116,Les Mées,04,,,041160000B0621,,,,,,,,,,,,,0,,,,,BT,taillis simples,,,6740,6.013326,44.043427
2019-34464,2019-02-20,000001,Vente,69000,,,RAGONY,B120,04190,04116,Les Mées,04,,,041160000E1766,,,,,,,,,,,,,0,,,,,AB,terrains a bâtir,,,528,5.925845,43.975612
2019-34464,2019-02-20,000001,Vente,69000,,,RAGONY,B120,04190,04116,Les Mées,04,,,041160000E1770,,,,,,,,,,,,,0,,,,,AB,terrains a bâtir,RUE,Rue,508,5.92574,43.975831
2019-34466,2019-02-20,000001,Vente,65000,,,RAGONY,B120,04190,04116,Les Mées,04,,,041160000E1761,,,,,,,,,,,,,0,,,,,AB,terrains a bâtir,,,421,5.925654,43.976
2019-34466,2019-02-20,000001,Vente,65000,,,RAGONY,B120,04190,04116,Les Mées,04,,,041160000E1770,,,,,,,,,,,,,0,,,,,AB,terrains a bâtir,RUE,Rue,508,5.92574,43.975831
2019-34470,2019-02-22,000001,Vente,149370,7486,,CHE DES VARZELLES,0182,04190,04116,Les Mées,04,,,041160000A0508,,,24,59.9,60,,,,,,,,2,2,Appartement,60,3,,,,,,,
2019-34508,2019-02-16,000001,Vente,156000,,,LES TRABUCS,B141,04190,04116,Les Mées,04,,,041160000D0314,,,,,,,,,,,,,0,,,,,S,sols,,,54,5.931388,43.954315
2019-34508,2019-02-16,000001,Vente,156000,,,LES POURCELLES,B114,04190,04116,Les Mées,04,,,041160000D0760,,,,,,,,,,,,,0,1,Maison,68,3,S,sols,,,501,5.931244,43.954347
2019-34623,2019-02-27,000001,Vente,88650,,,LA ROBERTE,B126,04190,04116,Les Mées,04,,,041160000A2011,,,,,,,,,,,,,0,,,,,AB,terrains a bâtir,,,985,,
2019-34675,2019-03-11,000001,Vente,19000,7486,,CHE DES VARZELLES,0182,04190,04116,Les Mées,04,,,041160000A0508,,,95,,,,,,,,,,1,3,Dépendance,,0,,,,,,,
2019-34704,2019-03-01,000001,Vente,157000,10,B,RUE ALPHONSE DAUDET,0008,04190,04116,Les Mées,04,,,041160000C1821,,,,,,,,,,,,,0,1,Maison,75,4,S,sols,,,268,5.964959,44.028073
2019-34704,2019-03-01,000001,Vente,157000,,,LA CHAUCHIERE,B027,04190,04116,Les Mées,04,,,041160000C1824,,,,,,,,,,,,,0,,,,,S,sols,,,16,5.965039,44.027921
2019-34704,2019-03-01,000001,Vente,157000,,,LA CHAUCHIERE,B027,04190,04116,Les Mées,04,,,041160000C1826,,,,,,,,,,,,,0,,,,,S,sols,,,99,5.965,44.02789
2019-34715,2019-03-09,000001,Vente,300000,,,LA COLLE D ABARIS,B030,04190,04116,Les Mées,04,,,041160000C0505,,,,,,,,,,,,,0,,,,,L,landes,VAGUE,Terrain vague,3420,6.000173,44.010176
2019-34715,2019-03-09,000001,Vente,300000,,,LA COLLE D ABARIS,B030,04190,04116,Les Mées,04,,,041160000C0506,,,,,,,,,,,,,0,,,,,L,landes,VAGUE,Terrain vague,21300,6.000647,44.010519
2019-34715,2019-03-09,000001,Vente,300000,,,LA COLLE D ABARIS,B030,04190,04116,Les Mées,04,,,041160000C0507,,,,,,,,,,,,,0,,,,,T,terres,,,19710,6.001285,44.010206
2019-34715,2019-03-09,000001,Vente,300000,,,LA COLLE D ABARIS,B030,04190,04116,Les Mées,04,,,041160000C0508,,,,,,,,,,,,,0,,,,,L,landes,VAGUE,Terrain vague,1980,6.001747,44.009594
2019-34715,2019-03-09,000001,Vente,300000,,,LA COLLE D ABARIS,B030,04190,04116,Les Mées,04,,,041160000C0509,,,,,,,,,,,,,0,,,,,L,landes,VAGUE,Terrain vague,440,6.001645,44.010768
2019-34715,2019-03-09,000001,Vente,300000,,,LA COLLE D ABARIS,B030,04190,04116,Les Mées,04,,,041160000C0510,,,,,,,,,,,,,0,,,,,L,landes,VAGUE,Terrain vague,8300,6.001949,44.01006
2019-34715,2019-03-09,000001,Vente,300000,,,LA COLLE D ABARIS,B030,04190,04116,Les Mées,04,,,041160000C0511,,,,,,,,,,,,,0,,,,,T,terres,,,6760,6.002518,44.009773
2019-34715,2019-03-09,000001,Vente,300000,,,LA COLLE D ABARIS,B030,04190,04116,Les Mées,04,,,041160000C0512,,,,,,,,,,,,,0,,,,,L,landes,VAGUE,Terrain vague,12470,6.00288,44.008853
2019-34715,2019-03-09,000001,Vente,300000,,,LA COLLE D ABARIS,B030,04190,04116,Les Mées,04,,,041160000C0513,,,,,,,,,,,,,0,,,,,L,landes,VAGUE,Terrain vague,4570,6.003353,44.00735
2019-34715,2019-03-09,000001,Vente,300000,,,LA COLLE D ABARIS,B030,04190,04116,Les Mées,04,,,041160000C0514,,,,,,,,,,,,,0,,,,,L,landes,VAGUE,Terrain vague,890,6.003339,44.006457
2019-34715,2019-03-09,000001,Vente,300000,5076,,LA COLLE D ABARIS,B030,04190,04116,Les Mées,04,,,041160000C0515,,,,,,,,,,,,,0,1,Maison,120,5,S,sols,,,795,6.00129,44.007566
2019-34715,2019-03-09,000001,Vente,300000,,,LA COLLE D ABARIS,B030,04190,04116,Les Mées,04,,,041160000C0522,,,,,,,,,,,,,0,,,,,L,landes,VAGUE,Terrain vague,5540,6.000671,44.005379
2019-34715,2019-03-09,000001,Vente,300000,,,LA COLLE D ABARIS,B030,04190,04116,Les Mées,04,,,041160000C0523,,,,,,,,,,,,,0,,,,,L,landes,VAGUE,Terrain vague,1170,6.002944,44.005371
2019-34715,2019-03-09,000001,Vente,300000,,,MOURUFY,B089,04190,04116,Les Mées,04,,,041160000C0589,,,,,,,,,,,,,0,,,,,L,landes,VAGUE,Terrain vague,38430,5.99665,44.009112
2019-34715,2019-03-09,000001,Vente,300000,,,MOURUFY,B089,04190,04116,Les Mées,04,,,041160000C0590,,,,,,,,,,,,,0,,,,,L,landes,VAGUE,Terrain vague,78190,5.998075,44.008059
2019-34715,2019-03-09,000001,Vente,300000,,,MOURUFY,B089,04190,04116,Les Mées,04,,,041160000C0591,,,,,,,,,,,,,0,,,,,BT,taillis simples,,,5150,5.994804,44.007699
2019-34715,2019-03-09,000001,Vente,300000,,,LA COLLE D ABARIS,B030,04190,04116,Les Mées,04,,,041160000C1800,,,,,,,,,,,,,0,,,,,T,terres,,,93335,6.001721,44.006929
2019-34715,2019-03-09,000001,Vente,300000,,,LA COLLE D ABARIS,B030,04190,04116,Les Mées,04,,,041160000C1802,,,,,,,,,,,,,0,,,,,L,landes,VAGUE,Terrain vague,3605,5.999052,44.006546
2019-34718,2019-03-08,000001,Vente,188600,1,,LOT LE PLEIN SUD,X051,04190,04116,Les Mées,04,,,041160000A1959,,,,,,,,,,,,,0,1,Maison,83,4,S,sols,,,362,,
2019-34736,2019-03-22,000001,Vente,15000,,,LA HAUTE GREE,B066,04190,04116,Les Mées,04,,,041160000F0975,,,,,,,,,,,,,0,,,,,VE,vergers,,,500,5.951499,43.99591
2019-34736,2019-03-22,000001,Vente,15000,,,LA HAUTE GREE,B066,04190,04116,Les Mées,04,,,041160000F0975,,,,,,,,,,,,,0,,,,,VE,vergers,OLIVE,Oliveraie ou oliviers,1740,5.951499,43.99591
2019-34787,2019-03-12,000001,Vente,91000,4,,RUE ROUGUIERE,0160,04190,04116,Les Mées,04,,,041160000G0786,,,2,103.63,,,,,,,,,1,1,Maison,75,4,,,,,,5.976804,44.029507
2019-34850,2019-03-13,000001,Vente,44500,15,D,RUE BONNE FONTAINE,0025,04190,04116,Les Mées,04,,,041160000G0353,,,,,,,,,,,,,0,1,Maison,55,2,S,sols,,,26,5.97661,44.028316
2019-34950,2019-04-08,000001,Vente,92500,2,,RUE DE LIBERTE ET DES INSURGES,0090,04190,04116,Les Mées,04,,,041160000G0259,,,1,91.1,,,,,,,,,1,2,Appartement,91,4,,,,,,5.975097,44.029222
2019-34960,2019-03-27,000001,Vente,5000,,,LES PENITENTS,B095,04190,04116,Les Mées,04,,,041160000F0934,,,,,,,,,,,,,0,,,,,VE,vergers,OLIVE,Oliveraie ou oliviers,740,5.955997,43.99954
2019-34964,2019-03-29,000002,Vente,1020,,,DABISSE,B040,04190,04116,Les Mées,04,,,041160000E1772,,,,,,,,,,,,,0,,,,,P,prés,,,102,5.926825,43.98229
2019-35002,2019-03-29,000001,Vente,650000,5165,,MAL NOURRIS,B083,04190,04116,Les Mées,04,,,041160000E0555,,,,,,,,,,,,,0,2,Appartement,148,3,S,sols,,,880,5.923716,43.966126
2019-35002,2019-03-29,000001,Vente,650000,5165,,MAL NOURRIS,B083,04190,04116,Les Mées,04,,,041160000E0555,,,,,,,,,,,,,0,2,Appartement,135,2,S,sols,,,880,5.923716,43.966126
2019-35002,2019-03-29,000001,Vente,650000,5165,,MAL NOURRIS,B083,04190,04116,Les Mées,04,,,041160000E0555,,,,,,,,,,,,,0,2,Appartement,139,4,S,sols,,,880,5.923716,43.966126
2019-35002,2019-03-29,000001,Vente,650000,,,MAL NOURRIS,B083,04190,04116,Les Mées,04,,,041160000E0989,,,,,,,,,,,,,0,,,,,P,prés,,,2628,5.923725,43.965926
2019-35002,2019-03-29,000001,Vente,650000,,,LA BASTIDE BLANCHE,B010,04190,04116,Les Mées,04,,,041160000E1592,,,,,,,,,,,,,0,,,,,P,prés,,,1326,5.923906,43.96638
2019-35002,2019-03-29,000001,Vente,650000,,,LA BASTIDE BLANCHE,B010,04190,04116,Les Mées,04,,,041160000E1594,,,,,,,,,,,,,0,,,,,T,terres,,,1001,5.923468,43.965995
2019-35002,2019-03-29,000001,Vente,650000,,,LA BASTIDE BLANCHE,B010,04190,04116,Les Mées,04,,,041160000E1595,,,,,,,,,,,,,0,,,,,T,terres,,,382,5.923706,43.966081
2019-35058,2019-04-08,000001,Vente,146010,7486,,CHE DES VARZELLES,0182,04190,04116,Les Mées,04,,,041160000A0508,,,42,,75,,,,,,,,2,2,Appartement,70,3,,,,,,,
2019-35131,2019-04-12,000001,Vente,50000,,,DABISSE,B040,04190,04116,Les Mées,04,,,041160000E1773,,,,,,,,,,,,,0,,,,,P,prés,,,2508,5.926593,43.981827
2019-35132,2019-04-10,000001,Vente,10000,,,PICON,B099,04190,04116,Les Mées,04,,,041160000D0064,,,,,,,,,,,,,0,,,,,BT,taillis simples,,,14105,5.937271,43.966796
2019-35132,2019-04-10,000001,Vente,10000,,,PICON,B099,04190,04116,Les Mées,04,,,041160000D0065,,,,,,,,,,,,,0,,,,,T,terres,,,5575,5.937354,43.966519
2019-35132,2019-04-10,000001,Vente,10000,,,PICON,B099,04190,04116,Les Mées,04,,,041160000D0066,,,,,,,,,,,,,0,,,,,T,terres,,,1010,5.937821,43.966175
2019-35132,2019-04-10,000001,Vente,10000,,,PICON,B099,04190,04116,Les Mées,04,,,041160000D0067,,,,,,,,,,,,,0,,,,,BT,taillis simples,,,2400,5.936631,43.966468
2019-35132,2019-04-10,000001,Vente,10000,,,PICON,B099,04190,04116,Les Mées,04,,,041160000D0067,,,,,,,,,,,,,0,,,,,T,terres,,,1000,5.936631,43.966468
2019-35167,2019-04-18,000001,Vente,100000,7149,,TAURA,B138,04190,04116,Les Mées,04,,,041160000C1673,,,,,,,,,,,,,0,4,Local industriel. commercial ou assimilé,166,0,S,sols,,,1459,,
2019-35271,2019-04-25,000001,Vente,800,,,LES FOURCHES,B049,04190,04116,Les Mées,04,,,041160000F1565,,,,,,,,,,,,,0,,,,,VE,vergers,OLIVE,Oliveraie ou oliviers,275,5.961087,44.019938
2019-35271,2019-04-25,000001,Vente,800,,,LES FOURCHES,B049,04190,04116,Les Mées,04,,,041160000F1903,,,,,,,,,,,,,0,,,,,L,landes,VAGUE,Terrain vague,724,5.960878,44.019704
2019-35273,2019-04-26,000001,Vente,21000,,,SAINT PIERRE,B132,04190,04116,Les Mées,04,,,041160000C0822,,,,,,,,,,,,,0,,,,,VE,vergers,OLIVE,Oliveraie ou oliviers,3360,5.960221,44.014092
2019-35274,2019-04-24,000002,Vente,800,,,LES FOURCHES,B049,04190,04116,Les Mées,04,,,041160000F3255,,,,,,,,,,,,,0,,,,,VE,vergers,OLIVE,Oliveraie ou oliviers,746,5.960156,44.020016
2019-35488,2019-05-10,000001,Vente,4000,,,LE PEAOU,B094,04190,04116,Les Mées,04,,,041160000F2440,,,,,,,,,,,,,0,,,,,T,terres,,,5635,5.933883,43.99907
2019-35597,2019-05-16,000001,Vente,68000,5105,,HAMEAU DE DABISSE,B061,04190,04116,Les Mées,04,,,041160000E0987,,,1,,2,125.3,,,,,,,2,1,Maison,109,3,,,,,,5.926314,43.984024
2019-35622,2019-06-04,000001,Vente,2000,,,LEOUVIERE,B080,04190,04116,Les Mées,04,,,041160000C0250,,,,,,,,,,,,,0,,,,,L,landes,VAGUE,Terrain vague,1110,5.963677,44.01841
2019-35714,2019-05-28,000001,Vente,15000,,,LES PRADAS DES POURCELLES,B116,04190,04116,Les Mées,04,,,041160000E0738,,,,,,,,,,,,,0,,,,,T,terres,,,575,5.926293,43.952157
2019-35714,2019-05-28,000001,Vente,15000,,,LES PRADAS DES POURCELLES,B116,04190,04116,Les Mées,04,,,041160000E0739,,,,,,,,,,,,,0,,,,,T,terres,,,430,5.926725,43.952117
2019-35753,2019-06-07,000001,Vente,3000,,,LE VILLAGE,B152,04190,04116,Les Mées,04,,,041160000G0934,,,,,,,,,,,,,0,,,,,S,sols,,,56,5.978852,44.029783
2019-35805,2019-06-07,000001,Vente,36000,,,NOTRE DAME,B090,04190,04116,Les Mées,04,,,041160000A0242,,,,,,,,,,,,,0,,,,,T,terres,,,2330,6.009916,44.044564
2019-35805,2019-06-07,000001,Vente,36000,,,NOTRE DAME,B090,04190,04116,Les Mées,04,,,041160000A0243,,,,,,,,,,,,,0,,,,,T,terres,,,850,6.009612,44.044393
2019-35805,2019-06-07,000001,Vente,36000,,,NOTRE DAME,B090,04190,04116,Les Mées,04,,,041160000A0244,,,,,,,,,,,,,0,,,,,T,terres,,,1275,6.009457,44.044288
2019-35805,2019-06-07,000001,Vente,36000,,,NOTRE DAME,B090,04190,04116,Les Mées,04,,,041160000A0248,,,,,,,,,,,,,0,,,,,T,terres,,,1655,6.008246,44.04587
2019-35805,2019-06-07,000001,Vente,36000,,,NOTRE DAME,B090,04190,04116,Les Mées,04,,,041160000A0251,,,,,,,,,,,,,0,,,,,T,terres,,,130,6.009347,44.045373
2019-35805,2019-06-07,000001,Vente,36000,,,NOTRE DAME,B090,04190,04116,Les Mées,04,,,041160000A0255,,,,,,,,,,,,,0,,,,,T,terres,,,780,6.009678,44.045541
2019-35805,2019-06-07,000001,Vente,36000,,,NOTRE DAME,B090,04190,04116,Les Mées,04,,,041160000A0303,,,,,,,,,,,,,0,,,,,T,terres,,,585,6.006702,44.044481
2019-35805,2019-06-07,000001,Vente,36000,,,NOTRE DAME,B090,04190,04116,Les Mées,04,,,041160000A0304,,,,,,,,,,,,,0,,,,,T,terres,,,620,6.006715,44.044237
2019-35805,2019-06-07,000001,Vente,36000,,,NOTRE DAME,B090,04190,04116,Les Mées,04,,,041160000A0316,,,,,,,,,,,,,0,,,,,T,terres,,,1260,6.008407,44.044366
2019-35805,2019-06-07,000001,Vente,36000,,,NOTRE DAME,B090,04190,04116,Les Mées,04,,,041160000A0322,,,,,,,,,,,,,0,,,,,T,terres,,,2665,6.006428,44.043522
2019-35805,2019-06-07,000001,Vente,36000,,,NOTRE DAME,B090,04190,04116,Les Mées,04,,,041160000A0337,,,,,,,,,,,,,0,,,,,T,terres,,,3175,6.003882,44.043143
2019-35805,2019-06-07,000001,Vente,36000,,,NOTRE DAME,B090,04190,04116,Les Mées,04,,,041160000A0338,,,,,,,,,,,,,0,,,,,T,terres,,,6480,6.002971,44.043787
2019-35805,2019-06-07,000001,Vente,36000,,,PONT DE DIGNE,B112,04190,04116,Les Mées,04,,,041160000A0370,,,,,,,,,,,,,0,,,,,T,terres,,,2065,6.001462,44.041239
2019-35805,2019-06-07,000001,Vente,36000,,,PONT DE DIGNE,B112,04190,04116,Les Mées,04,,,041160000A0371,,,,,,,,,,,,,0,,,,,T,terres,,,2050,6.001324,44.041117
2019-35805,2019-06-07,000001,Vente,36000,,,NOTRE DAME,B090,04190,04116,Les Mées,04,,,041160000A0857,,,,,,,,,,,,,0,,,,,T,terres,,,690,6.010482,44.044519
2019-35805,2019-06-07,000001,Vente,36000,,,NOTRE DAME,B090,04190,04116,Les Mées,04,,,041160000A1369,,,,,,,,,,,,,0,,,,,T,terres,,,6944,6.007641,44.043677
2019-35805,2019-06-07,000001,Vente,36000,,,NOTRE DAME,B090,04190,04116,Les Mées,04,,,041160000A1377,,,,,,,,,,,,,0,,,,,T,terres,,,3663,6.006567,44.043036
2019-35807,2019-06-04,000001,Vente,15000,,,LA HAUTE GREE,B066,04190,04116,Les Mées,04,,,041160000F0993,,,,,,,,,,,,,0,,,,,VE,vergers,OLIVE,Oliveraie ou oliviers,4200,5.953274,43.995262
2019-35893,2019-06-14,000001,Vente,60000,,,RAGONY,B120,04190,04116,Les Mées,04,,,041160000E1769,,,,,,,,,,,,,0,,,,,AB,terrains a bâtir,,,438,5.925518,43.975591
2019-35893,2019-06-14,000001,Vente,60000,,,RAGONY,B120,04190,04116,Les Mées,04,,,041160000E1770,,,,,,,,,,,,,0,,,,,AB,terrains a bâtir,RUE,Rue,508,5.92574,43.975831
2019-35927,2019-06-11,000001,Vente,1500,,,LES BOURELLES,B017,04190,04116,Les Mées,04,,,041160000F0042,,,,,,,,,,,,,0,,,,,L,landes,VAGUE,Terrain vague,120,5.957037,44.018797
2019-35930,2019-06-11,000001,Vente,4000,,,LES FOURCHES,B049,04190,04116,Les Mées,04,,,041160000F2854,,,,,,,,,,,,,0,,,,,L,landes,VAGUE,Terrain vague,343,5.961269,44.018442
2019-35965,2019-06-20,000001,Vente,197300,11,,CHE DES VARZELLES,0182,04190,04116,Les Mées,04,,,041160000A2088,,,,,,,,,,,,,0,1,Maison,70,3,S,sols,,,607,,
2019-35997,2019-06-14,000001,Vente,43800,18,,RUE VIRGILE PONS,0185,04190,04116,Les Mées,04,,,041160000G0715,,,10,35.86,,,,,,,,,1,2,Appartement,37,2,,,,,,5.977499,44.029509
2019-36096,2019-06-29,000001,Vente,1500,,,LEOUVIERE,B080,04190,04116,Les Mées,04,,,041160000C1215,,,,,,,,,,,,,0,,,,,L,landes,VAGUE,Terrain vague,3580,5.968672,44.023871
2019-36122,2019-06-28,000001,Vente,155000,7509,A,RESERVE DE LA TABIACE,B124,04190,04116,Les Mées,04,,,041160000F3237,,,,,,,,,,,,,0,1,Maison,80,3,S,sols,,,528,5.927963,43.985766
2019-36159,2019-07-02,000001,Vente,150820,22,,RUE DE LIBERTE ET DES INSURGES,0090,04190,04116,Les Mées,04,,,041160000G1111,,,,,,,,,,,,,0,1,Maison,85,4,S,sols,,,185,5.974121,44.028048
2019-36201,2019-07-10,000001,Vente,46000,,,HAMEAU DE DABISSE,B061,04190,04116,Les Mées,04,,,041160000E1639,,,,,,,,,,,,,0,,,,,S,sols,,,294,5.927946,43.98358
2019-36222,2019-07-02,000001,Vente,160000,1,,CHE DE LA MINE,0100,04190,04116,Les Mées,04,,,041160000G1537,,,,,,,,,,,,,0,1,Maison,100,5,S,sols,,,680,5.980002,44.031157
2019-36227,2019-07-03,000001,Vente,15000,,,LEOUVIERE,B080,04190,04116,Les Mées,04,,,041160000C1845,,,,,,,,,,,,,0,,,,,VE,vergers,OLIVE,Oliveraie ou oliviers,3767,5.967345,44.021802
2019-36235,2019-07-10,000001,Vente,100000,11,,LES MAS DU PARAIRE,B153,04190,04116,Les Mées,04,,,041160000G1349,,,,,,,,,,,,,0,1,Maison,76,4,S,sols,,,215,5.978766,44.032272
2019-36387,2019-07-27,000001,Vente,291580,7452,,CHE DE LA ROBERTE,0149,04190,04116,Les Mées,04,,,041160000A1673,,,,,,,,,,,,,0,1,Maison,110,4,S,sols,,,777,,
2019-36400,2019-07-26,000001,Vente,15000,,,PLAN DE TALON,B107,04190,04116,Les Mées,04,,,041160000F0370,,,,,,,,,,,,,0,,,,,VE,vergers,OLIVE,Oliveraie ou oliviers,7130,5.955902,44.004659
2019-36493,2019-07-17,000001,Vente,177250,4,,LES MAS DU PARAIRE,B153,04190,04116,Les Mées,04,,,041160000G1342,,,,,,,,,,,,,0,1,Maison,76,4,S,sols,,,234,5.978284,44.031888
2019-36545,2019-08-06,000001,Vente,190000,,,LE VILLAGE,B152,04190,04116,Les Mées,04,,,041160000G0734,,,,,,,,,,,,,0,,,,,S,sols,,,100,5.977188,44.028958
2019-36545,2019-08-06,000001,Vente,190000,15,,RUE CLOVIS PICON,0040,04190,04116,Les Mées,04,,,041160000G0737,,,,,,,,,,,,,0,2,Appartement,90,4,S,sols,,,65,5.977098,44.028906
2019-36545,2019-08-06,000001,Vente,190000,15,,RUE CLOVIS PICON,0040,04190,04116,Les Mées,04,,,041160000G0737,,,,,,,,,,,,,0,2,Appartement,49,2,S,sols,,,65,5.977098,44.028906
2019-36545,2019-08-06,000001,Vente,190000,15,,RUE CLOVIS PICON,0040,04190,04116,Les Mées,04,,,041160000G0737,,,,,,,,,,,,,0,2,Appartement,50,2,S,sols,,,65,5.977098,44.028906
2019-36545,2019-08-06,000001,Vente,190000,15,,RUE CLOVIS PICON,0040,04190,04116,Les Mées,04,,,041160000G0737,,,,,,,,,,,,,0,2,Appartement,95,3,S,sols,,,65,5.977098,44.028906
2019-36605,2019-08-03,000001,Vente,35000,,,LE VILLAGE,B152,04190,04116,Les Mées,04,,,041160000G0892,,,,,,,,,,,,,0,,,,,S,sols,,,45,5.979233,44.030202
2019-36765,2019-08-29,000001,Vente,32800,,,L ISCLE,B071,04190,04116,Les Mées,04,,,041160000A0870,,,,,,,,,,,,,0,,,,,VE,vergers,,,3600,5.975483,44.036501
2019-36765,2019-08-29,000001,Vente,32800,,,L ISCLE,B071,04190,04116,Les Mées,04,,,041160000A0876,,,,,,,,,,,,,0,,,,,VE,vergers,,,11700,5.976657,44.036562
2019-36765,2019-08-29,000001,Vente,32800,,,L ISCLE,B071,04190,04116,Les Mées,04,,,041160000A1038,,,,,,,,,,,,,0,,,,,BT,taillis simples,,,312,5.974856,44.039157
2019-36765,2019-08-29,000001,Vente,32800,,,L ISCLE,B071,04190,04116,Les Mées,04,,,041160000A2068,,,,,,,,,,,,,0,,,,,T,terres,,,1108,5.976164,44.035759
2019-36765,2019-08-29,000001,Vente,32800,,,L ISCLE,B071,04190,04116,Les Mées,04,,,041160000A2070,,,,,,,,,,,,,0,,,,,T,terres,,,4702,5.977184,44.036125
2019-36765,2019-08-29,000001,Vente,32800,,,L ISCLE,B071,04190,04116,Les Mées,04,,,041160000A2072,,,,,,,,,,,,,0,,,,,VE,vergers,,,10336,5.974993,44.038351
2019-36765,2019-08-29,000001,Vente,32800,,,L ISCLE,B071,04190,04116,Les Mées,04,,,041160000A2072,,,,,,,,,,,,,0,,,,,T,terres,,,10337,5.974993,44.038351
2019-36765,2019-08-29,000001,Vente,32800,,,L ISCLE,B071,04190,04116,Les Mées,04,,,041160000A2073,,,,,,,,,,,,,0,,,,,VE,vergers,,,7347,5.97626,44.037089
2019-36765,2019-08-29,000001,Vente,32800,,,L ISCLE,B071,04190,04116,Les Mées,04,,,041160000A2074,,,,,,,,,,,,,0,,,,,VE,vergers,,,4510,5.974352,44.037697
2019-36765,2019-08-29,000001,Vente,32800,,,L ISCLE,B071,04190,04116,Les Mées,04,,,041160000A2074,,,,,,,,,,,,,0,,,,,T,terres,,,4510,5.974352,44.037697
2019-36765,2019-08-29,000001,Vente,32800,,,L ISCLE,B071,04190,04116,Les Mées,04,,,041160000A2075,,,,,,,,,,,,,0,,,,,VE,vergers,,,1240,5.975091,44.036908
2019-36773,2019-08-28,000001,Vente,190000,2,,RUE HENRI BOSCO,0082,04190,04116,Les Mées,04,,,041160000C1222,,,,,,,,,,,,,0,1,Maison,87,5,S,sols,,,656,5.968651,44.026902
2019-36773,2019-08-28,000001,Vente,190000,,,LA CHAUCHIERE,B027,04190,04116,Les Mées,04,,,041160000C1448,,,,,,,,,,,,,0,,,,,S,sols,,,140,5.968756,44.026768
2019-36973,2019-09-20,000001,Vente,240000,5174,,HAMEAU DES POURCELLES,B062,04190,04116,Les Mées,04,,,041160000E1264,,,,,,,,,,,,,0,1,Maison,130,4,S,sols,,,247,5.929441,43.954644
2019-37012,2019-09-25,000001,Vente,600000,19,B,BD DES TILLEULS,0180,04190,04116,Les Mées,04,,,041160000G0127,,,,,,,,,,,,,0,4,Local industriel. commercial ou assimilé,71,0,S,sols,,,960,5.979719,44.03083
2019-37012,2019-09-25,000001,Vente,600000,19,B,BD DES TILLEULS,0180,04190,04116,Les Mées,04,,,041160000G0127,,,,,,,,,,,,,0,1,Maison,128,7,S,sols,,,960,5.979719,44.03083
2019-37012,2019-09-25,000001,Vente,600000,7127,,BD DES TILLEULS,0180,04190,04116,Les Mées,04,,,041160000G1534,,,,,,,,,,,,,0,2,Appartement,101,4,S,sols,,,610,5.979563,44.03087