id_mutation,date_mutation,numero_disposition,nature_mutation,valeur_fonciere,adresse_numero,adresse_suffixe,adresse_nom_voie,adresse_code_voie,code_postal,code_commune,nom_commune,code_departement,ancien_code_commune,ancien_nom_commune,id_parcelle,ancien_id_parcelle,numero_volume,lot1_numero,lot1_surface_carrez,lot2_numero,lot2_surface_carrez,lot3_numero,lot3_surface_carrez,lot4_numero,lot4_surface_carrez,lot5_numero,lot5_surface_carrez,nombre_lots,code_type_local,type_local,surface_reelle_bati,nombre_pieces_principales,code_nature_culture,nature_culture,code_nature_culture_speciale,nature_culture_speciale,surface_terrain,longitude,latitude
2019-38932,2019-01-18,000001,Vente,59000,5152,,LE VILLAGE,B073,05140,05019,La Beaume,05,,,050190000A0493,,,,,,,,,,,,,0,1,Maison,63,1,S,sols,,,73,5.636296,44.553606
2019-39111,2019-02-13,000001,Vente,900,,,LES MONTAGNES ET CHATALLA,B054,05140,05019,La Beaume,05,,,050190000B0130,,,,,,,,,,,,,0,,,,,L,landes,,,2085,5.639359,44.552026
2019-39111,2019-02-13,000001,Vente,900,,,LES MONTAGNES ET CHATALLA,B054,05140,05019,La Beaume,05,,,050190000B0131,,,,,,,,,,,,,0,,,,,L,landes,,,7078,5.639119,44.552553
2019-39111,2019-02-13,000001,Vente,900,,,LES MONTAGNES ET CHATALLA,B054,05140,05019,La Beaume,05,,,050190000B0134,,,,,,,,,,,,,0,,,,,L,landes,,,3104,5.639129,44.552953
2019-40038,2019-04-13,000002,Vente,800,,,LES NOYERS,B056,05140,05019,La Beaume,05,,,050190000B1753,,,,,,,,,,,,,0,,,,,L,landes,,,1,5.672942,44.554177
2019-40038,2019-04-13,000002,Vente,800,,,LE VILLARD,B074,05140,05019,La Beaume,05,,,050190000B1756,,,,,,,,,,,,,0,,,,,S,sols,,,28,5.672964,44.553945
2019-40038,2019-04-13,000002,Vente,800,,,LE VILLARD,B074,05140,05019,La Beaume,05,,,050190000B1759,,,,,,,,,,,,,0,,,,,L,landes,,,170,5.673009,44.554085
2019-40038,2019-04-13,000002,Vente,800,,,LE VILLARD,B074,05140,05019,La Beaume,05,,,050190000B1760,,,,,,,,,,,,,0,,,,,L,landes,,,27,5.672918,44.553925
2019-40038,2019-04-13,000002,Vente,800,,,DERRIERE LE SERRE ET LA TO,B035,05140,05019,La Beaume,05,,,050190000C0868,,,,,,,,,,,,,0,,,,,L,landes,,,203,5.673206,44.554087
2019-40038,2019-04-13,000002,Vente,800,,,DERRIERE LE SERRE ET LA TO,B035,05140,05019,La Beaume,05,,,050190000C0869,,,,,,,,,,,,,0,,,,,L,landes,,,83213,5.67471,44.557271
2019-40038,2019-04-13,000003,Vente,800,,,LE VILLARD,B074,05140,05019,La Beaume,05,,,050190000B1757,,,,,,,,,,,,,0,,,,,S,sols,,,76,5.672784,44.553823
2019-40733,2019-06-11,000001,Vente,5000,,,LE VILLAGE,B073,05140,05019,La Beaume,05,,,050190000A0520,,,,,,,,,,,,,0,,,,,J,jardins,,,97,5.633542,44.553285
2019-40733,2019-06-11,000001,Vente,5000,,,LE VILLAGE,B073,05140,05019,La Beaume,05,,,050190000A0521,,,,,,,,,,,,,0,,,,,T,terres,,,232,5.633378,44.553236
2019-40733,2019-06-11,000001,Vente,5000,,,LE VILLAGE,B073,05140,05019,La Beaume,05,,,050190000A0522,,,,,,,,,,,,,0,,,,,S,sols,,,378,5.633164,44.553228
2019-41414,2019-07-22,000001,Vente,50000,5048,,RUE DU ROURE,0078,05140,05019,La Beaume,05,,,050190000A0549,,,1,,,,,,,,,,1,2,Appartement,13,1,,,,,,5.635896,44.553064
2019-41414,2019-07-22,000001,Vente,50000,5047,,RUE DU ROURE,0078,05140,05019,La Beaume,05,,,050190000A0550,,,,,,,,,,,,,0,1,Maison,60,2,S,sols,,,80,5.635749,44.553129
2019-43261,2019-10-31,000001,Vente,108700,5061,A,RUE DE LA COTE,0030,05140,05019,La Beaume,05,,,050190000A0436,,,,,,,,,,,,,0,1,Maison,67,4,S,sols,,,280,5.636158,44.553999
