id_mutation,date_mutation,numero_disposition,nature_mutation,valeur_fonciere,adresse_numero,adresse_suffixe,adresse_nom_voie,adresse_code_voie,code_postal,code_commune,nom_commune,code_departement,ancien_code_commune,ancien_nom_commune,id_parcelle,ancien_id_parcelle,numero_volume,lot1_numero,lot1_surface_carrez,lot2_numero,lot2_surface_carrez,lot3_numero,lot3_surface_carrez,lot4_numero,lot4_surface_carrez,lot5_numero,lot5_surface_carrez,nombre_lots,code_type_local,type_local,surface_reelle_bati,nombre_pieces_principales,code_nature_culture,nature_culture,code_nature_culture_speciale,nature_culture_speciale,surface_terrain,longitude,latitude
2019-38995,2019-01-31,000001,Vente,9190,,,SERRE DU BUIS,B229,05380,05036,Châteauroux-les-Alpes,05,,,050360000A2015,,,,,,,,,,,,,0,,,,,L,landes,,,707,6.562427,44.634802
2019-38995,2019-01-31,000001,Vente,9190,,,SERRE DU BUIS,B229,05380,05036,Châteauroux-les-Alpes,05,,,050360000A2016,,,,,,,,,,,,,0,,,,,T,terres,,,723,6.562043,44.634781
2019-38995,2019-01-31,000001,Vente,9190,,,SERRE DU BUIS,B229,05380,05036,Châteauroux-les-Alpes,05,,,050360000A2019,,,,,,,,,,,,,0,,,,,L,landes,,,1020,6.561688,44.634503
2019-38995,2019-01-31,000001,Vente,9190,,,SAINT ALBAN,B213,05380,05036,Châteauroux-les-Alpes,05,,,050360000A2020,,,,,,,,,,,,,0,,,,,L,landes,,,3227,6.561256,44.63461
2019-38995,2019-01-31,000001,Vente,9190,,,SAINT ALBAN,B213,05380,05036,Châteauroux-les-Alpes,05,,,050360000A2021,,,,,,,,,,,,,0,,,,,P,prés,,,4805,6.560639,44.634419
2019-38995,2019-01-31,000001,Vente,9190,,,SAINT ALBAN,B213,05380,05036,Châteauroux-les-Alpes,05,,,050360000A2025,,,,,,,,,,,,,0,,,,,T,terres,,,536,6.561179,44.635613
2019-38995,2019-01-31,000001,Vente,9190,,,SAINT ALBAN,B213,05380,05036,Châteauroux-les-Alpes,05,,,050360000A2028,,,,,,,,,,,,,0,,,,,P,prés,,,1160,6.561633,44.635387
2019-38995,2019-01-31,000001,Vente,9190,,,SAINT ALBAN,B213,05380,05036,Châteauroux-les-Alpes,05,,,050360000A2032,,,,,,,,,,,,,0,,,,,T,terres,,,1024,6.561801,44.635813
2019-38995,2019-01-31,000001,Vente,9190,,,SAINT ALBAN,B213,05380,05036,Châteauroux-les-Alpes,05,,,050360000A2033,,,,,,,,,,,,,0,,,,,P,prés,,,1176,6.561535,44.635838
2019-38995,2019-01-31,000001,Vente,9190,,,SAINT ALBAN,B213,05380,05036,Châteauroux-les-Alpes,05,,,050360000A2041,,,,,,,,,,,,,0,,,,,P,prés,,,5002,6.560124,44.635788
2019-38995,2019-01-31,000001,Vente,9190,,,SAINT ALBAN,B213,05380,05036,Châteauroux-les-Alpes,05,,,050360000A2042,,,,,,,,,,,,,0,,,,,L,landes,,,400,6.559621,44.635628
2019-38995,2019-01-31,000001,Vente,9190,,,SAINT ALBAN,B213,05380,05036,Châteauroux-les-Alpes,05,,,050360000A4038,,,,,,,,,,,,,0,,,,,T,terres,,,5920,6.560452,44.634694
2019-39055,2019-01-26,000001,Vente,210000,5270,,FONTFOURANE,B114,05380,05036,Châteauroux-les-Alpes,05,,,050360000B2546,,,,,,,,,,,,,0,1,Maison,55,4,S,sols,,,968,6.528092,44.621174
2019-39055,2019-01-26,000001,Vente,210000,5270,,FONTFOURANE,B114,05380,05036,Châteauroux-les-Alpes,05,,,050360000B2546,,,,,,,,,,,,,0,1,Maison,55,4,T,terres,,,960,6.528092,44.621174
2019-39195,2019-02-16,000001,Vente,157000,5075,,LES AUBERGERIES,B006,05380,05036,Châteauroux-les-Alpes,05,,,05036000AB0356,,,,,,,,,,,,,0,2,Appartement,50,4,S,sols,,,198,6.522079,44.614466
2019-39195,2019-02-16,000001,Vente,157000,5075,,LES AUBERGERIES,B006,05380,05036,Châteauroux-les-Alpes,05,,,05036000AB0356,,,,,,,,,,,,,0,4,Local industriel. commercial ou assimilé,247,0,S,sols,,,198,6.522079,44.614466
2019-39195,2019-02-16,000001,Vente,157000,5075,,LES AUBERGERIES,B006,05380,05036,Châteauroux-les-Alpes,05,,,05036000AB0356,,,,,,,,,,,,,0,4,Local industriel. commercial ou assimilé,186,0,S,sols,,,198,6.522079,44.614466
2019-39198,2019-02-16,000001,Vente,10000,,,LES AUBERGERIES,B006,05380,05036,Châteauroux-les-Alpes,05,,,05036000AB0357,,,,,,,,,,,,,0,,,,,S,sols,,,91,6.522211,44.614545
2019-39645,2019-03-27,000001,Echange,5700,,,PRE SABENS,B196,05380,05036,Châteauroux-les-Alpes,05,,,050360000D1301,,,,,,,,,,,,,0,,,,,T,terres,,,777,6.510648,44.601601
2019-39645,2019-03-27,000001,Echange,5700,,,PRE SABENS,B196,05380,05036,Châteauroux-les-Alpes,05,,,050360000D1302,,,,,,,,,,,,,0,,,,,P,prés,,,409,,
2019-39645,2019-03-27,000001,Echange,5700,,,PRE SABENS,B196,05380,05036,Châteauroux-les-Alpes,05,,,050360000D1304,,,,,,,,,,,,,0,,,,,T,terres,,,354,6.51114,44.601742
2019-39645,2019-03-27,000001,Echange,5700,,,LES VALENTINOIS,B244,05380,05036,Châteauroux-les-Alpes,05,,,05036000ZD0037,,,,,,,,,,,,,0,,,,,T,terres,,,4820,6.508765,44.601526
2019-39646,2019-03-27,000002,Echange,6500,,,PRE SABENS,B196,05380,05036,Châteauroux-les-Alpes,05,,,050360000D2051,,,,,,,,,,,,,0,,,,,P,prés,,,2865,6.511153,44.602059
2019-39646,2019-03-27,000002,Echange,6500,,,LES VALENTINOIS,B244,05380,05036,Châteauroux-les-Alpes,05,,,05036000ZD0034,,,,,,,,,,,,,0,,,,,T,terres,,,6040,6.509076,44.599421
2019-39647,2019-03-27,000003,Echange,750,,,PRE SABENS,B196,05380,05036,Châteauroux-les-Alpes,05,,,050360000D1301,,,,,,,,,,,,,0,,,,,T,terres,,,777,6.510648,44.601601
2019-39647,2019-03-27,000003,Echange,750,,,PRE SABENS,B196,05380,05036,Châteauroux-les-Alpes,05,,,050360000D1302,,,,,,,,,,,,,0,,,,,P,prés,,,409,,
2019-39647,2019-03-27,000003,Echange,750,,,PRE SABENS,B196,05380,05036,Châteauroux-les-Alpes,05,,,050360000D1304,,,,,,,,,,,,,0,,,,,T,terres,,,354,6.51114,44.601742
2019-39920,2019-04-06,000001,Vente,199000,,,LES AUBERGERIES,B006,05380,05036,Châteauroux-les-Alpes,05,,,05036000AB0161,,,,,,,,,,,,,0,,,,,S,sols,,,10,6.519649,44.612253
2019-39920,2019-04-06,000001,Vente,199000,,,LES AUBERGERIES,B006,05380,05036,Châteauroux-les-Alpes,05,,,05036000AB0162,,,,,,,,,,,,,0,,,,,J,jardins,,,246,6.519575,44.61229
2019-39920,2019-04-06,000001,Vente,199000,5035,,LES AUBERGERIES,B006,05380,05036,Châteauroux-les-Alpes,05,,,05036000AB0170,,,,,,,,,,,,,0,1,Maison,77,4,S,sols,,,303,6.519415,44.612106
2019-40132,2019-04-26,000001,Vente,456000,5678,F,LES ALPES,B003,05380,05036,Châteauroux-les-Alpes,05,,,05036000AC0204,,,,,,,,,,,,,0,1,Maison,153,4,S,sols,,,1346,6.525353,44.614681
2019-40552,2019-05-17,000001,Vente,106900,,,LES AUBERGERIES,B006,05380,05036,Châteauroux-les-Alpes,05,,,05036000AB0141,,,,,,,,,,,,,0,,,,,T,terres,,,497,6.520445,44.612414
2019-40552,2019-05-17,000001,Vente,106900,5034,,LES AUBERGERIES,B006,05380,05036,Châteauroux-les-Alpes,05,,,05036000AB0171,,,,,,,,,,,,,0,1,Maison,85,5,S,sols,,,70,6.51957,44.612063
2019-40826,2019-06-01,000001,Vente,250000,,,LES CHAMPETS,B050,05380,05036,Châteauroux-les-Alpes,05,,,050360000D1858,,,,,,,,,,,,,0,,,,,T,terres,,,74,6.507179,44.606464
2019-40826,2019-06-01,000001,Vente,250000,,,LES CHAMPETS,B050,05380,05036,Châteauroux-les-Alpes,05,,,050360000D1859,,,,,,,,,,,,,0,,,,,L,landes,,,4,6.507254,44.606433
2019-40826,2019-06-01,000001,Vente,250000,5422,,LES CHAMPETS,B050,05380,05036,Châteauroux-les-Alpes,05,,,050360000D2047,,,,,,,,,,,,,0,1,Maison,65,3,T,terres,,,1672,6.507312,44.606798
2019-41028,2019-06-15,000001,Vente,3200,,,COSTE CHASTEL,B078,05380,05036,Châteauroux-les-Alpes,05,,,050360000B2040,,,,,,,,,,,,,0,,,,,L,landes,,,228,6.532596,44.621833
2019-41028,2019-06-15,000001,Vente,3200,,,COSTE CHASTEL,B078,05380,05036,Châteauroux-les-Alpes,05,,,050360000B2046,,,,,,,,,,,,,0,,,,,L,landes,,,340,6.531769,44.622168
2019-41028,2019-06-15,000001,Vente,3200,,,LA FOURZANNE,B119,05380,05036,Châteauroux-les-Alpes,05,,,050360000E1417,,,,,,,,,,,,,0,,,,,BR,futaies résineuses,,,9350,6.490143,44.620306
2019-41028,2019-06-15,000001,Vente,3200,,,LES EYSSIROLLES,B106,05380,05036,Châteauroux-les-Alpes,05,,,050360000E1438,,,,,,,,,,,,,0,,,,,BR,futaies résineuses,,,4232,6.487671,44.616018
2019-41028,2019-06-15,000001,Vente,3200,,,CLOT JAUNIER,B068,05380,05036,Châteauroux-les-Alpes,05,,,050360000E1560,,,,,,,,,,,,,0,,,,,L,landes,,,951,6.487873,44.614443
2019-41028,2019-06-15,000001,Vente,3200,,,LA FONTAINE DES CROTTES,B111,05380,05036,Châteauroux-les-Alpes,05,,,050360000E1676,,,,,,,,,,,,,0,,,,,BR,futaies résineuses,,,991,6.488619,44.607347
2019-41028,2019-06-15,000001,Vente,3200,,,LA FONTAINE DES CROTTES,B111,05380,05036,Châteauroux-les-Alpes,05,,,050360000E1686,,,,,,,,,,,,,0,,,,,BR,futaies résineuses,,,2020,6.488639,44.606004
2019-41029,2019-06-18,000001,Vente,1801.17,,,LA FOURZANNE,B119,05380,05036,Châteauroux-les-Alpes,05,,,050360000E1405,,,,,,,,,,,,,0,,,,,BR,futaies résineuses,,,8577,6.489179,44.621739
2019-41458,2019-07-02,000001,Vente,175000,5183,,SAINT ROCH,B219,05380,05036,Châteauroux-les-Alpes,05,,,050360000D0566,,,,,,,,,,,,,0,2,Appartement,83,4,S,sols,,,778,6.511746,44.609686
2019-41458,2019-07-02,000001,Vente,175000,5183,,SAINT ROCH,B219,05380,05036,Châteauroux-les-Alpes,05,,,050360000D0566,,,,,,,,,,,,,0,2,Appartement,83,4,S,sols,,,778,6.511746,44.609686
2019-41497,2019-07-18,000001,Vente,38500,5381,,SAINT CLAUDE,B214,05380,05036,Châteauroux-les-Alpes,05,,,050360000D1918,,,9,24.92,,,,,,,,,1,2,Appartement,25,2,,,,,,6.519239,44.609443
2019-41497,2019-07-18,000001,Vente,38500,5381,,SAINT CLAUDE,B214,05380,05036,Châteauroux-les-Alpes,05,,,050360000D1918,,,34,,,,,,,,,,1,3,Dépendance,,0,,,,,,6.519239,44.609443
2019-41497,2019-07-18,000001,Vente,38500,5381,,SAINT CLAUDE,B214,05380,05036,Châteauroux-les-Alpes,05,,,050360000D1918,,,21,,,,,,,,,,1,3,Dépendance,,0,,,,,,6.519239,44.609443
2019-41500,2019-07-09,000001,Vente,997,,,PRE DU PAS,B190,05380,05036,Châteauroux-les-Alpes,05,,,050360000D1012,,,,,,,,,,,,,0,,,,,P,prés,,,3450,6.497852,44.600065
2019-41500,2019-07-09,000001,Vente,997,,,PEGNERE,B173,05380,05036,Châteauroux-les-Alpes,05,,,050360000E1058,,,,,,,,,,,,,0,,,,,L,landes,,,730,6.497528,44.600336
2019-41500,2019-07-09,000001,Vente,997,,,PEGNERE,B173,05380,05036,Châteauroux-les-Alpes,05,,,050360000E1059,,,,,,,,,,,,,0,,,,,P,prés,,,806,6.497378,44.600138
2019-41501,2019-07-09,000002,Vente,886,,,LES BALEYRES,B009,05380,05036,Châteauroux-les-Alpes,05,,,050360000E0523,,,,,,,,,,,,,0,,,,,L,landes,,,4430,6.493295,44.603063
2019-41599,2019-07-17,000001,Vente,211776,5690,F,LES TARDONS,B236,05380,05036,Châteauroux-les-Alpes,05,,,050360000D1167,,,,,,,,,,,,,0,1,Maison,60,3,S,sols,,,598,6.503891,44.602791
2019-41599,2019-07-17,000001,Vente,211776,,,LES TARDONS,B236,05380,05036,Châteauroux-les-Alpes,05,,,050360000D1168,,,,,,,,,,,,,0,,,,,S,sols,,,206,6.504023,44.602681
2019-41826,2019-07-27,000001,Vente,15474,,,LA RESTE,B202,05380,05036,Châteauroux-les-Alpes,05,,,050360000D1067,,,,,,,,,,,,,0,,,,,J,jardins,,,240,6.501333,44.600238
2019-41979,2019-08-31,000001,Vente,130000,5157,,AV DE LA GARE,0250,05380,05036,Châteauroux-les-Alpes,05,,,05036000AD0485,,,2,93.2,,,,,,,,,1,3,Dépendance,,0,,,,,,6.525522,44.611067
2019-41979,2019-08-31,000001,Vente,130000,5157,,AV DE LA GARE,0250,05380,05036,Châteauroux-les-Alpes,05,,,05036000AD0485,,,6,,,,,,,,,,1,3,Dépendance,,0,,,,,,6.525522,44.611067
2019-41980,2019-08-21,000001,Vente,30000,5157,,AV DE LA GARE,0250,05380,05036,Châteauroux-les-Alpes,05,,,05036000AD0485,,,5,,,,,,,,,,1,3,Dépendance,,0,,,,,,6.525522,44.611067
2019-42269,2019-09-06,000001,Vente,150000,5078,,LES AUBERGERIES,B006,05380,05036,Châteauroux-les-Alpes,05,,,05036000AB0073,,,,,,,,,,,,,0,1,Maison,80,3,S,sols,,,32,6.522195,44.614856
2019-42344,2019-08-31,000001,Vente,140000,5314,,SERRE BUZARD,B223,05380,05036,Châteauroux-les-Alpes,05,,,050360000A1641,,,1,98.3,,,,,,,,,1,2,Appartement,98,3,,,,,,6.543874,44.638214
2019-42473,2019-09-30,000001,Vente,3473.2,,,LES BALEYRES,B009,05380,05036,Châteauroux-les-Alpes,05,,,050360000E0510,,,,,,,,,,,,,0,,,,,BR,futaies résineuses,,,2400,6.491464,44.60491
2019-42473,2019-09-30,000001,Vente,3473.2,,,LA FONTAINE DES CROTTES,B111,05380,05036,Châteauroux-les-Alpes,05,,,050360000E1679,,,,,,,,,,,,,0,,,,,BR,futaies résineuses,,,14966,6.492105,44.606005
2019-42499,2019-09-12,000001,Vente,1500,,,LA SAGNE,B211,05380,05036,Châteauroux-les-Alpes,05,,,050360000B0538,,,,,,,,,,,,,0,,,,,T,terres,,,4920,6.515953,44.622737
2019-42568,2019-09-26,000001,Vente,210000,5046,,LES AUBERGERIES,B006,05380,05036,Châteauroux-les-Alpes,05,,,05036000AB0123,,,,,,,,,,,,,0,1,Maison,75,3,S,sols,,,79,6.520475,44.613303
2019-42648,2019-10-05,000001,Echange,3032,,,LE PIRAILLO,B185,05380,05036,Châteauroux-les-Alpes,05,,,050360000F0107,,,,,,,,,,,,,0,,,,,L,landes,,,4860,6.439442,44.650791
2019-42648,2019-10-05,000001,Echange,3032,,,LE SERRE,B222,05380,05036,Châteauroux-les-Alpes,05,,,050360000F0241,,,,,,,,,,,,,0,,,,,L,landes,,,1510,6.448426,44.647418
2019-42648,2019-10-05,000002,Echange,3032,,,LE SERRE,B222,05380,05036,Châteauroux-les-Alpes,05,,,050360000E1086,,,,,,,,,,,,,0,,,,,L,landes,,,2260,6.43882,44.645734
2019-42648,2019-10-05,000002,Echange,3032,,,LE SERRE,B222,05380,05036,Châteauroux-les-Alpes,05,,,050360000E1105,,,,,,,,,,,,,0,,,,,L,landes,,,850,6.443926,44.645549
2019-42648,2019-10-05,000002,Echange,3032,,,LE SERRE,B222,05380,05036,Châteauroux-les-Alpes,05,,,050360000E1121,,,,,,,,,,,,,0,,,,,BR,futaies résineuses,,,779,6.444637,44.644199
2019-42648,2019-10-05,000002,Echange,3032,,,LE SERRE,B222,05380,05036,Châteauroux-les-Alpes,05,,,050360000E1122,,,,,,,,,,,,,0,,,,,L,landes,,,1120,6.444707,44.644618
2019-42648,2019-10-05,000002,Echange,3032,,,LE SERRE,B222,05380,05036,Châteauroux-les-Alpes,05,,,050360000E1153,,,,,,,,,,,,,0,,,,,L,landes,,,420,6.445885,44.643522
2019-42648,2019-10-05,000002,Echange,3032,,,LE SERRE,B222,05380,05036,Châteauroux-les-Alpes,05,,,050360000E1744,,,,,,,,,,,,,0,,,,,L,landes,,,2519,6.443504,44.645557
2019-42648,2019-10-05,000002,Echange,3032,,,LES GALERES,B120,05380,05036,Châteauroux-les-Alpes,05,,,050360000F0098,,,,,,,,,,,,,0,,,,,L,landes,,,1610,6.441685,44.647324
2019-42689,2019-09-19,000001,Vente,100000,5056,,LES AUBERGERIES,B006,05380,05036,Châteauroux-les-Alpes,05,,,05036000AB0107,,,6,48.45,,,,,,,,,1,2,Appartement,105,4,,,,,,6.520552,44.613787
2019-42689,2019-09-19,000001,Vente,100000,5056,,LES AUBERGERIES,B006,05380,05036,Châteauroux-les-Alpes,05,,,05036000AB0107,,,6,48.45,,,,,,,,,1,2,Appartement,35,2,,,,,,6.520552,44.613787
2019-42689,2019-09-19,000001,Vente,100000,5056,,LES AUBERGERIES,B006,05380,05036,Châteauroux-les-Alpes,05,,,05036000AB0107,,,6,48.45,,,,,,,,,1,2,Appartement,55,3,,,,,,6.520552,44.613787
2019-42689,2019-09-19,000001,Vente,100000,5056,,LES AUBERGERIES,B006,05380,05036,Châteauroux-les-Alpes,05,,,05036000AB0107,,,6,48.45,,,,,,,,,1,4,Local industriel. commercial ou assimilé,79,0,,,,,,6.520552,44.613787
2019-42689,2019-09-19,000001,Vente,100000,,,LES AUBERGERIES,B006,05380,05036,Châteauroux-les-Alpes,05,,,05036000AB0243,,,,,,,,,,,,,0,,,,,L,landes,,,10,6.520386,44.613847
2019-42978,2019-10-14,000001,Vente,260000,5001,A,SAINT CLAUDE,B214,05380,05036,Châteauroux-les-Alpes,05,,,050360000C1681,,,,,,,,,,,,,0,1,Maison,106,6,S,sols,,,1547,6.519897,44.610179
2019-42978,2019-10-14,000001,Vente,260000,,,SAINT CLAUDE,B214,05380,05036,Châteauroux-les-Alpes,05,,,050360000C1684,,,,,,,,,,,,,0,,,,,S,sols,,,17,6.519667,44.610321
2019-42999,2019-10-15,000001,Vente,150000,,,LA RESTE,B202,05380,05036,Châteauroux-les-Alpes,05,,,050360000D1076,,,,,,,,,,,,,0,,,,,S,sols,,,121,6.501753,44.600201
2019-42999,2019-10-15,000001,Vente,150000,5196,,LA RESTE,B202,05380,05036,Châteauroux-les-Alpes,05,,,050360000D1077,,,,,,,,,,,,,0,1,Maison,45,2,S,sols,,,235,6.501968,44.600314
2019-42999,2019-10-15,000001,Vente,150000,,,LA RESTE,B202,05380,05036,Châteauroux-les-Alpes,05,,,050360000D1078,,,,,,,,,,,,,0,,,,,S,sols,,,134,6.501945,44.600125
2019-43071,2019-10-14,000001,Echange,5000,5490,,PRE SABENS,B196,05380,05036,Châteauroux-les-Alpes,05,,,050360000D2134,,,,,,,,,,,,,0,1,Maison,128,3,S,sols,,,53,6.510222,44.602325
2019-43114,2019-10-26,000001,Vente,159615,5549,,FONTMOLINE,B115,05380,05036,Châteauroux-les-Alpes,05,,,05036000ZC0185,,,,,,,,,,,,,0,2,Appartement,65,3,S,sols,,,862,6.522728,44.604877
2019-43114,2019-10-26,000001,Vente,159615,5549,,FONTMOLINE,B115,05380,05036,Châteauroux-les-Alpes,05,,,05036000ZC0185,,,,,,,,,,,,,0,2,Appartement,20,1,S,sols,,,862,6.522728,44.604877
2019-43241,2019-10-29,000001,Vente,317300,5539,,LES TAXILS,B237,05380,05036,Châteauroux-les-Alpes,05,,,05036000AC0195,,,,,,,,,,,,,0,1,Maison,132,4,S,sols,,,730,6.52461,44.611846
2019-43312,2019-11-25,000001,Echange,20000,5115,A,LES BERARDS,B019,05380,05036,Châteauroux-les-Alpes,05,,,05036000AD0111,,,2,,,,,,,,,,1,3,Dépendance,,0,,,,,,6.528009,44.615344
2019-43313,2019-11-25,000002,Echange,7000,,,SAINT CLAUDE,B214,05380,05036,Châteauroux-les-Alpes,05,,,050360000C0533,,,,,,,,,,,,,0,,,,,P,prés,,,3748,6.520281,44.610862
2019-43487,2019-12-03,000001,Vente,1812,,,SAINTE CATHERINE,B220,05380,05036,Châteauroux-les-Alpes,05,,,05036000AD0173,,,,,,,,,,,,,0,,,,,T,terres,,,285,6.530671,44.61538
2019-43487,2019-12-03,000001,Vente,1812,,,SAINTE CATHERINE,B220,05380,05036,Châteauroux-les-Alpes,05,,,05036000AD0174,,,,,,,,,,,,,0,,,,,T,terres,,,242,6.530698,44.615214
2019-43487,2019-12-03,000001,Vente,1812,,,SAINTE CATHERINE,B220,05380,05036,Châteauroux-les-Alpes,05,,,05036000AD0179,,,,,,,,,,,,,0,,,,,P,prés,,,983,6.530796,44.615126
2019-43625,2019-11-21,000001,Vente,70000,,,LES ROZANS,B209,05380,05036,Châteauroux-les-Alpes,05,,,050360000D1638,,,,,,,,,,,,,0,,,,,L,landes,,,15,6.506344,44.604611
2019-43625,2019-11-21,000001,Vente,70000,5187,,LES ROZANS,B209,05380,05036,Châteauroux-les-Alpes,05,,,050360000D2027,,,,,,,,,,,,,0,1,Maison,60,2,S,sols,,,496,6.506602,44.604765
2019-43704,2019-11-21,000001,Vente,3000,,,SERRE DE CHAMPIER,B224,05380,05036,Châteauroux-les-Alpes,05,,,050360000A3403,,,,,,,,,,,,,0,,,,,VI,vignes,,,4186,6.547701,44.629197
2019-43704,2019-11-21,000001,Vente,3000,,,SERRE DE CHAMPIER,B224,05380,05036,Châteauroux-les-Alpes,05,,,050360000A3404,,,,,,,,,,,,,0,,,,,L,landes,,,86,6.547124,44.628954
2019-43704,2019-11-21,000001,Vente,3000,,,LES GENSULS,B125,05380,05036,Châteauroux-les-Alpes,05,,,050360000D0518,,,,,,,,,,,,,0,,,,,J,jardins,,,595,6.516897,44.613595
2019-43704,2019-11-21,000001,Vente,3000,,,LES GENSULS,B125,05380,05036,Châteauroux-les-Alpes,05,,,050360000D1542,,,,,,,,,,,,,0,,,,,P,prés,,,1492,6.516841,44.613038
2019-43704,2019-11-21,000001,Vente,3000,,,LES GENSULS,B125,05380,05036,Châteauroux-les-Alpes,05,,,050360000D1543,,,,,,,,,,,,,0,,,,,L,landes,,,38,6.517126,44.61322
2019-43704,2019-11-21,000001,Vente,3000,,,LES GENSULS,B125,05380,05036,Châteauroux-les-Alpes,05,,,050360000D1544,,,,,,,,,,,,,0,,,,,P,prés,,,740,6.517112,44.61343
2019-43704,2019-11-21,000001,Vente,3000,,,LES GENSULS,B125,05380,05036,Châteauroux-les-Alpes,05,,,050360000D1545,,,,,,,,,,,,,0,,,,,L,landes,,,30,6.517322,44.613363
2019-43704,2019-11-21,000001,Vente,3000,,,PEGNERE,B173,05380,05036,Châteauroux-les-Alpes,05,,,050360000E1042,,,,,,,,,,,,,0,,,,,L,landes,,,602,6.496264,44.600972
2019-43704,2019-11-21,000001,Vente,3000,,,CLOT JAUNIER,B068,05380,05036,Châteauroux-les-Alpes,05,,,050360000E1508,,,,,,,,,,,,,0,,,,,BR,futaies résineuses,,,2110,6.488775,44.611664
2019-43704,2019-11-21,000001,Vente,3000,,,BELLERES,B018,05380,05036,Châteauroux-les-Alpes,05,,,050360000E1667,,,,,,,,,,,,,0,,,,,BR,futaies résineuses,,,8680,6.489204,44.609549
2019-43704,2019-11-21,000001,Vente,3000,,,CLOT LA DONNE,B069,05380,05036,Châteauroux-les-Alpes,05,,,05036000ZD0075,,,,,,,,,,,,,0,,,,,T,terres,,,8480,6.514387,44.597106
2019-43704,2019-11-21,000001,Vente,3000,,,CLOT LA DONNE,B069,05380,05036,Châteauroux-les-Alpes,05,,,05036000ZD0079,,,,,,,,,,,,,0,,,,,T,terres,,,6360,6.515385,44.598063
2019-43704,2019-11-21,000001,Vente,3000,,,LES BLEYNES,B022,05380,05036,Châteauroux-les-Alpes,05,,,05036000ZD0132,,,,,,,,,,,,,0,,,,,P,prés,,,10380,6.517127,44.594294
2019-43704,2019-11-21,000001,Vente,3000,,,BRAMAFAN,B024,05380,05036,Châteauroux-les-Alpes,05,,,05036000ZD0171,,,,,,,,,,,,,0,,,,,P,prés,,,28370,6.516312,44.595016
2019-43784,2019-11-23,000001,Vente,104040,5381,,SAINT CLAUDE,B214,05380,05036,Châteauroux-les-Alpes,05,,,050360000D1918,,,30,,,,,,,,,,1,3,Dépendance,,0,,,,,,6.519239,44.609443
2019-43784,2019-11-23,000001,Vente,104040,5381,,SAINT CLAUDE,B214,05380,05036,Châteauroux-les-Alpes,05,,,050360000D1918,,,4,51.17,,,,,,,,,1,2,Appartement,51,2,,,,,,6.519239,44.609443
2019-43784,2019-11-23,000001,Vente,104040,5381,,SAINT CLAUDE,B214,05380,05036,Châteauroux-les-Alpes,05,,,050360000D1918,,,17,,,,,,,,,,1,3,Dépendance,,0,,,,,,6.519239,44.609443
