id_mutation,date_mutation,numero_disposition,nature_mutation,valeur_fonciere,adresse_numero,adresse_suffixe,adresse_nom_voie,adresse_code_voie,code_postal,code_commune,nom_commune,code_departement,ancien_code_commune,ancien_nom_commune,id_parcelle,ancien_id_parcelle,numero_volume,lot1_numero,lot1_surface_carrez,lot2_numero,lot2_surface_carrez,lot3_numero,lot3_surface_carrez,lot4_numero,lot4_surface_carrez,lot5_numero,lot5_surface_carrez,nombre_lots,code_type_local,type_local,surface_reelle_bati,nombre_pieces_principales,code_nature_culture,nature_culture,code_nature_culture_speciale,nature_culture_speciale,surface_terrain,longitude,latitude
2019-39275,2019-03-01,000001,Vente,58020,,,LES GRANGES,B044,05140,05055,La Faurie,05,,,050550000D1137,,,,,,,,,,,,,0,,,,,L,landes,,,204,5.725745,44.566868
2019-39275,2019-03-01,000001,Vente,58020,,,LES GRANGES,B044,05140,05055,La Faurie,05,,,050550000D1139,,,,,,,,,,,,,0,,,,,L,landes,,,32,5.726012,44.566803
2019-39275,2019-03-01,000001,Vente,58020,,,LES GRANGES,B044,05140,05055,La Faurie,05,,,050550000D1143,,,,,,,,,,,,,0,,,,,L,landes,,,347,5.725931,44.567003
2019-39275,2019-03-01,000001,Vente,58020,5281,,LES GRANGES,B044,05140,05055,La Faurie,05,,,050550000D1435,,,1,,2,,4,,,,,,3,3,Dépendance,,0,,,,,,5.72599,44.566933
2019-39275,2019-03-01,000001,Vente,58020,5106,,LES GRANGES,B044,05140,05055,La Faurie,05,,,050550000D1436,,,,,,,,,,,,,0,1,Maison,150,4,S,sols,,,166,5.7259,44.566944
2019-39275,2019-03-01,000001,Vente,58020,,,LES GRANGES,B044,05140,05055,La Faurie,05,,,050550000D1437,,,,,,,,,,,,,0,,,,,J,jardins,,,941,5.726089,44.566766
2019-39638,2019-03-12,000001,Vente,25000,5203,,LE VILLAGE,B091,05140,05055,La Faurie,05,,,050550000A1237,,,1,,2,,,,,,,,2,2,Appartement,20,2,,,,,,5.740046,44.566998
2019-39638,2019-03-12,000001,Vente,25000,5202,,LE VILLAGE,B091,05140,05055,La Faurie,05,,,050550000A1238,,,,,,,,,,,,,0,1,Maison,20,3,S,sols,,,51,5.739956,44.566932
2019-40642,2019-06-13,000001,Vente,20000,5033,,LE VILLAGE,B091,05140,05055,La Faurie,05,,,050550000A1083,,,,,,,,,,,,,0,1,Maison,60,2,S,sols,,,160,5.740056,44.567187
2019-40812,2019-06-25,000001,Vente,181675,5180,,LES VIGNASSES,B088,05140,05055,La Faurie,05,,,050550000E0549,,,,,,,,,,,,,0,1,Maison,110,4,S,sols,,,1405,5.723978,44.568757
2019-40812,2019-06-25,000001,Vente,181675,5180,,LES VIGNASSES,B088,05140,05055,La Faurie,05,,,050550000E0549,,,,,,,,,,,,,0,4,Local industriel. commercial ou assimilé,40,0,S,sols,,,1405,5.723978,44.568757
2019-41100,2019-07-06,000001,Vente,119220,5147,,SAINT ANDRE,B075,05140,05055,La Faurie,05,,,050550000E0092,,,,,,,,,,,,,0,1,Maison,80,4,S,sols,,,134,5.732598,44.567879
2019-41642,2019-08-08,000001,Vente,196750,5302,,PRE LA CHEVRE,B068,05140,05055,La Faurie,05,,,050550000A1370,,,,,,,,,,,,,0,1,Maison,122,5,S,sols,,,1000,5.745148,44.564408
2019-41642,2019-08-08,000001,Vente,196750,5302,,PRE LA CHEVRE,B068,05140,05055,La Faurie,05,,,050550000A1370,,,,,,,,,,,,,0,1,Maison,122,5,T,terres,,,1811,5.745148,44.564408
2019-42213,2019-09-06,000001,Vente,180000,5245,,LES VIGNASSES,B088,05140,05055,La Faurie,05,,,050550000E0504,,,,,,,,,,,,,0,1,Maison,174,6,S,sols,,,1445,5.721785,44.569402
2019-42213,2019-09-06,000001,Vente,180000,,,LES VIGNASSES,B088,05140,05055,La Faurie,05,,,050550000E0506,,,,,,,,,,,,,0,,,,,L,landes,,,244,5.721774,44.569064
2019-42213,2019-09-06,000001,Vente,180000,,,LES VIGNASSES,B088,05140,05055,La Faurie,05,,,050550000E0507,,,,,,,,,,,,,0,,,,,L,landes,,,385,5.721648,44.568931
2019-42458,2019-10-01,000001,Vente,210000,5105,A,ABBAYES ET PRES ROND,B001,05140,05055,La Faurie,05,,,050550000D1201,,,,,,,,,,,,,0,1,Maison,115,6,L,landes,,,5530,5.731868,44.565419
2019-42458,2019-10-01,000001,Vente,210000,5105,A,ABBAYES ET PRES ROND,B001,05140,05055,La Faurie,05,,,050550000D1201,,,,,,,,,,,,,0,1,Maison,115,6,S,sols,,,4220,5.731868,44.565419
