id_mutation,date_mutation,numero_disposition,nature_mutation,valeur_fonciere,adresse_numero,adresse_suffixe,adresse_nom_voie,adresse_code_voie,code_postal,code_commune,nom_commune,code_departement,ancien_code_commune,ancien_nom_commune,id_parcelle,ancien_id_parcelle,numero_volume,lot1_numero,lot1_surface_carrez,lot2_numero,lot2_surface_carrez,lot3_numero,lot3_surface_carrez,lot4_numero,lot4_surface_carrez,lot5_numero,lot5_surface_carrez,nombre_lots,code_type_local,type_local,surface_reelle_bati,nombre_pieces_principales,code_nature_culture,nature_culture,code_nature_culture_speciale,nature_culture_speciale,surface_terrain,longitude,latitude
2019-40097,2019-04-18,000001,Vente,213200,5211,,LES CHANETS,B008,05500,05147,Saint-Julien-en-Champsaur,05,,,051470000D0662,,,,,,,,,,,,,0,1,Maison,70,2,S,sols,,,728,6.116379,44.667275
2019-40097,2019-04-18,000001,Vente,213200,5211,,LES CHANETS,B008,05500,05147,Saint-Julien-en-Champsaur,05,,,051470000D0662,,,,,,,,,,,,,0,1,Maison,70,2,T,terres,,,1396,6.116379,44.667275
2019-40097,2019-04-18,000001,Vente,213200,,,LES CHANETS,B008,05500,05147,Saint-Julien-en-Champsaur,05,,,051470000D0663,,,,,,,,,,,,,0,,,,,T,terres,,,1320,6.116055,44.666944
2019-40224,2019-04-26,000001,Vente,70000,,,CHAMP ROUY ET CHAUVET,B006,05500,05147,Saint-Julien-en-Champsaur,05,,,051470000A0117,,,,,,,,,,,,,0,,,,,T,terres,,,2300,6.120855,44.669278
2019-40396,2019-05-02,000001,Vente,60,,,CHAMP ROUY ET CHAUVET,B006,05500,05147,Saint-Julien-en-Champsaur,05,,,051470000A0120,,,,,,,,,,,,,0,,,,,L,landes,,,200,6.120022,44.668639
2019-42853,2019-10-31,000001,Vente,225000,5238,,SUCHAREL,B035,05500,05147,Saint-Julien-en-Champsaur,05,,,051470000C0258,,,,,,,,,,,,,0,1,Maison,100,4,S,sols,,,2080,6.137699,44.669911
2019-42953,2019-10-22,000001,Vente,95000,,,BOZAC ET PRA CROS,B003,05500,05147,Saint-Julien-en-Champsaur,05,,,051470000D0417,,,,,,,,,,,,,0,,,,,T,terres,,,2120,6.112645,44.659149
2019-42953,2019-10-22,000001,Vente,95000,,,BOZAC ET PRA CROS,B003,05500,05147,Saint-Julien-en-Champsaur,05,,,051470000D0417,,,,,,,,,,,,,0,,,,,T,terres,,,4240,6.112645,44.659149
2019-42953,2019-10-22,000001,Vente,95000,,,BOZAC ET PRA CROS,B003,05500,05147,Saint-Julien-en-Champsaur,05,,,051470000D0537,,,,,,,,,,,,,0,,,,,T,terres,,,6566,6.113513,44.660378
2019-42953,2019-10-22,000001,Vente,95000,,,BOZAC ET PRA CROS,B003,05500,05147,Saint-Julien-en-Champsaur,05,,,051470000D0537,,,,,,,,,,,,,0,,,,,S,sols,,,1950,6.113513,44.660378
2019-44098,2019-12-10,000001,Echange,250000,5287,F,LE FOSSAS ET PRE LONG,B014,05500,05147,Saint-Julien-en-Champsaur,05,,,051470000C1198,,,,,,,,,,,,,0,1,Maison,125,4,S,sols,,,500,6.124116,44.655425
2019-44098,2019-12-10,000001,Echange,250000,5287,F,LE FOSSAS ET PRE LONG,B014,05500,05147,Saint-Julien-en-Champsaur,05,,,051470000C1198,,,,,,,,,,,,,0,1,Maison,125,4,J,jardins,,,945,6.124116,44.655425
