id_mutation,date_mutation,numero_disposition,nature_mutation,valeur_fonciere,adresse_numero,adresse_suffixe,adresse_nom_voie,adresse_code_voie,code_postal,code_commune,nom_commune,code_departement,ancien_code_commune,ancien_nom_commune,id_parcelle,ancien_id_parcelle,numero_volume,lot1_numero,lot1_surface_carrez,lot2_numero,lot2_surface_carrez,lot3_numero,lot3_surface_carrez,lot4_numero,lot4_surface_carrez,lot5_numero,lot5_surface_carrez,nombre_lots,code_type_local,type_local,surface_reelle_bati,nombre_pieces_principales,code_nature_culture,nature_culture,code_nature_culture_speciale,nature_culture_speciale,surface_terrain,longitude,latitude
2019-76338,2019-03-21,000001,Vente,7000,,,BRAMAFAN,B006,06620,06049,Courmes,06,,,060490000B0340,,,,,,,,,,,,,0,,,,,P,prés,,,580,6.989543,43.762023
2019-76352,2019-03-26,000001,Vente,437800,1900,,CD 503,0008,06620,06049,Courmes,06,,,060490000B0574,,,,,,,,,,,,,0,1,Maison,113,5,AG,terrains d'agrément,,,2500,6.998687,43.752472
2019-76352,2019-03-26,000001,Vente,437800,1900,,CD 503,0008,06620,06049,Courmes,06,,,060490000B0574,,,,,,,,,,,,,0,1,Maison,113,5,S,sols,,,500,6.998687,43.752472
2019-77447,2019-08-21,000001,Vente,18000,16,,PL DE L'EGLISE,0031,06620,06049,Courmes,06,,,060490000D0091,,,2,,,,,,,,,,1,2,Appartement,26,1,,,,,,7.008833,43.742274
2019-77462,2019-08-24,000001,Vente,,,,COLLET DE FREJUS,B016,06620,06049,Courmes,06,,,060490000B0135,,,,,,,,,,,,,0,,,,,BT,taillis simples,,,1750,7.002796,43.747403
2019-77793,2019-09-19,000001,Vente,250000,,,LE VILLAGE,B047,06620,06049,Courmes,06,,,060490000D0088,,,,,,,,,,,,,0,,,,,S,sols,,,52,7.008707,43.742329
2019-77793,2019-09-19,000001,Vente,250000,14,,RUE DU FOUR,0036,06620,06049,Courmes,06,,,060490000D0089,,,3,21.45,4,,,,,,,,2,2,Appartement,81,4,,,,,,7.008765,43.742297
2019-77793,2019-09-19,000001,Vente,250000,14,,RUE DU FOUR,0036,06620,06049,Courmes,06,,,060490000D0089,,,1,20.23,,,,,,,,,1,2,Appartement,49,3,,,,,,7.008765,43.742297
