id_mutation,date_mutation,numero_disposition,nature_mutation,valeur_fonciere,adresse_numero,adresse_suffixe,adresse_nom_voie,adresse_code_voie,code_postal,code_commune,nom_commune,code_departement,ancien_code_commune,ancien_nom_commune,id_parcelle,ancien_id_parcelle,numero_volume,lot1_numero,lot1_surface_carrez,lot2_numero,lot2_surface_carrez,lot3_numero,lot3_surface_carrez,lot4_numero,lot4_surface_carrez,lot5_numero,lot5_surface_carrez,nombre_lots,code_type_local,type_local,surface_reelle_bati,nombre_pieces_principales,code_nature_culture,nature_culture,code_nature_culture_speciale,nature_culture_speciale,surface_terrain,longitude,latitude
2019-87599,2019-01-14,000001,Vente,85000,3190,,RTE RD 86,0129,07340,07009,Andance,07,,,070090000C0642,,,,,,,,,,,,,0,1,Maison,65,4,S,sols,,,730,4.802359,45.207294
2019-87635,2019-01-18,000001,Vente,100000,5131,,RTE NATIONALE 86,0036,07340,07009,Andance,07,,,070090000A0894,,,,,,,,,,,,,0,2,Appartement,76,3,S,sols,,,168,4.799071,45.240583
2019-87635,2019-01-18,000001,Vente,100000,5131,,RTE NATIONALE 86,0036,07340,07009,Andance,07,,,070090000A0894,,,,,,,,,,,,,0,2,Appartement,40,1,S,sols,,,168,4.799071,45.240583
2019-87681,2019-01-24,000001,Vente,67700,5373,,LA MOTTE,B034,07340,07009,Andance,07,,,070090000B1108,,,12,,,,,,,,,,1,3,Dépendance,,0,,,,,,4.79318,45.239172
2019-87681,2019-01-24,000001,Vente,67700,5373,,LA MOTTE,B034,07340,07009,Andance,07,,,070090000B1108,,,30,,48,69.78,,,,,,,2,2,Appartement,71,4,,,,,,4.79318,45.239172
2019-87692,2019-01-31,000001,Vente,155200,6,,RUE DES JARDINS,0031,07340,07009,Andance,07,,,070090000A0560,,,,,,,,,,,,,0,1,Maison,90,4,S,sols,,,325,4.797924,45.238961
2019-87694,2019-01-28,000001,Vente,55000,5147,,RUE DES PAVES,0042,07340,07009,Andance,07,,,070090000A0468,,,,,,,,,,,,,0,4,Local industriel. commercial ou assimilé,200,0,S,sols,,,190,4.79871,45.240933
2019-87694,2019-01-28,000001,Vente,55000,5147,,RUE DES PAVES,0042,07340,07009,Andance,07,,,070090000A0468,,,,,,,,,,,,,0,1,Maison,62,3,S,sols,,,190,4.79871,45.240933
2019-87809,2019-02-05,000001,Vente,45000,,,CANSARD,B012,07340,07009,Andance,07,,,070090000C1361,,,,,,,,,,,,,0,,,,,T,terres,,,322,4.803715,45.208159
2019-87809,2019-02-05,000001,Vente,45000,330,,CHE DE CANSARD,0006,07340,07009,Andance,07,,,070090000C1364,,,,,,,,,,,,,0,1,Maison,56,2,S,sols,,,747,4.803663,45.208467
2019-87809,2019-02-05,000001,Vente,45000,330,,CHE DE CANSARD,0006,07340,07009,Andance,07,,,070090000C1364,,,,,,,,,,,,,0,4,Local industriel. commercial ou assimilé,238,0,S,sols,,,747,4.803663,45.208467
2019-87913,2019-02-28,000001,Vente,79000,100,,BOIS DE BIENNIER,B006,07340,07009,Andance,07,,,070090000B1492,,,,,,,,,,,,,0,,,,,AB,terrains a bâtir,,,980,4.793576,45.236492
2019-87944,2019-03-05,000001,Vente,1,,,LA TRENIERE,B048,07340,07009,Andance,07,,,070090000B1513,,,,,,,,,,,,,0,,,,,AG,terrains d'agrément,,,5,4.79657,45.23739
2019-87944,2019-03-05,000001,Vente,1,,,LA TRENIERE,B048,07340,07009,Andance,07,,,070090000B1501,,,,,,,,,,,,,0,,,,,AG,terrains d'agrément,,,7,4.796369,45.237727
2019-87944,2019-03-05,000001,Vente,1,,,LA TRENIERE,B048,07340,07009,Andance,07,,,070090000B1347,,,,,,,,,,,,,0,,,,,S,sols,,,72,4.795971,45.238105
2019-87946,2019-03-05,000001,Vente,1,,,LA TRENIERE,B048,07340,07009,Andance,07,,,070090000B1498,,,,,,,,,,,,,0,,,,,AG,terrains d'agrément,,,4,4.796337,45.237787
2019-87946,2019-03-05,000001,Vente,1,,,LA TRENIERE,B048,07340,07009,Andance,07,,,070090000B1511,,,,,,,,,,,,,0,,,,,AG,terrains d'agrément,,,26,4.796502,45.237497
2019-87946,2019-03-05,000001,Vente,1,,,LA TRENIERE,B048,07340,07009,Andance,07,,,070090000B1515,,,,,,,,,,,,,0,,,,,AG,terrains d'agrément,,,4,4.796598,45.237338
2019-87946,2019-03-05,000001,Vente,1,,,LA TRENIERE,B048,07340,07009,Andance,07,,,070090000B1517,,,,,,,,,,,,,0,,,,,AG,terrains d'agrément,,,2,4.796639,45.237275
2019-88207,2019-03-19,000001,Vente,65000,5141,,RTE NATIONALE 86,0036,07340,07009,Andance,07,,,070090000A0462,,,,,,,,,,,,,0,1,Maison,85,5,S,sols,,,125,4.79902,45.240641
2019-88271,2019-04-01,000001,Vente,233900,,,BOIS DE BIENNIER,B006,07340,07009,Andance,07,,,070090000B1419,,,,,,,,,,,,,0,,,,,BT,taillis simples,,,1778,4.791717,45.236268
2019-88271,2019-04-01,000001,Vente,233900,400,,CHE DU CREUX,0020,07340,07009,Andance,07,,,070090000B1609,,,,,,,,,,,,,0,3,Dépendance,,0,S,sols,,,145,4.791896,45.235848
2019-88271,2019-04-01,000001,Vente,233900,400,,CHE DU CREUX,0020,07340,07009,Andance,07,,,070090000B1609,,,,,,,,,,,,,0,2,Appartement,110,4,S,sols,,,145,4.791896,45.235848
2019-88271,2019-04-01,000001,Vente,233900,400,,CHE DU CREUX,0020,07340,07009,Andance,07,,,070090000B1609,,,,,,,,,,,,,0,2,Appartement,86,4,S,sols,,,145,4.791896,45.235848
2019-88271,2019-04-01,000001,Vente,233900,400,,CHE DU CREUX,0020,07340,07009,Andance,07,,,070090000B1609,,,,,,,,,,,,,0,3,Dépendance,,0,S,sols,,,145,4.791896,45.235848
2019-88271,2019-04-01,000001,Vente,233900,400,,CHE DU CREUX,0020,07340,07009,Andance,07,,,070090000B1609,,,,,,,,,,,,,0,2,Appartement,92,4,S,sols,,,145,4.791896,45.235848
2019-88271,2019-04-01,000001,Vente,233900,,,BOIS DE BIENNIER,B006,07340,07009,Andance,07,,,070090000B1613,,,,,,,,,,,,,0,,,,,S,sols,,,76,4.791817,45.235808
2019-88271,2019-04-01,000001,Vente,233900,,,BOIS DE BIENNIER,B006,07340,07009,Andance,07,,,070090000B1617,,,,,,,,,,,,,0,,,,,S,sols,,,1128,4.791707,45.235927
2019-88271,2019-04-01,000001,Vente,233900,,,BOIS DE BIENNIER,B006,07340,07009,Andance,07,,,070090000B1620,,3,,,,,,,,,,,0,,,,,,,,,,4.791728,45.235948
2019-88271,2019-04-01,000001,Vente,233900,,,BOIS DE BIENNIER,B006,07340,07009,Andance,07,,,070090000B1620,,4,,,,,,,,,,,0,,,,,,,,,,4.791728,45.235948
2019-88271,2019-04-01,000001,Vente,233900,,,BOIS DE BIENNIER,B006,07340,07009,Andance,07,,,070090000B1623,,,,,,,,,,,,,0,,,,,J,jardins,,,628,4.791237,45.235567
2019-88302,2019-04-15,000001,Vente,59000,5215,,RTE NATIONALE 86,0036,07340,07009,Andance,07,,,070090000A0619,,,,,,,,,,,,,0,1,Maison,220,5,S,sols,,,230,4.796981,45.237804
2019-88302,2019-04-15,000001,Vente,59000,,,LA CROISETTE,B021,07340,07009,Andance,07,,,070090000A0620,,,,,,,,,,,,,0,,,,,S,sols,,,55,4.797092,45.237884
2019-88329,2019-03-13,000001,Vente,90000,160,,CHE DES PECHES,0126,07340,07009,Andance,07,,,070090000C0541,,,,,,,,,,,,,0,1,Maison,65,3,S,sols,,,535,4.802389,45.211238
2019-88329,2019-03-13,000001,Vente,90000,,,LES PECHES,B038,07340,07009,Andance,07,,,070090000C1790,,,,,,,,,,,,,0,,,,,T,terres,,,977,4.802557,45.211295
2019-88435,2019-04-17,000001,Vente,108000,1,B,RUE DE SIZE,0056,07340,07009,Andance,07,,,070090000A0910,,,,,,,,,,,,,0,1,Maison,119,5,S,sols,,,62,4.797997,45.241036
2019-88459,2019-04-18,000002,Vente,252000,65,,IMP DE CANCETTE,0113,07340,07009,Andance,07,,,070090000C1325,,,,,,,,,,,,,0,1,Maison,90,2,S,sols,,,340,4.804166,45.209325
2019-88459,2019-04-18,000002,Vente,252000,65,,IMP DE CANCETTE,0113,07340,07009,Andance,07,,,070090000C1325,,,,,,,,,,,,,0,2,Appartement,25,2,S,sols,,,340,4.804166,45.209325
2019-88459,2019-04-18,000002,Vente,252000,,,CANSARD,B012,07340,07009,Andance,07,,,070090000C1943,,,,,,,,,,,,,0,,,,,T,terres,,,601,4.804637,45.209325
2019-88459,2019-04-18,000002,Vente,252000,,,CANSARD,B012,07340,07009,Andance,07,,,070090000C1945,,,,,,,,,,,,,0,,,,,T,terres,,,530,4.804514,45.209213
2019-88541,2019-04-26,000001,Vente,50000,5049,,RUE DE L HOPITAL,0028,07340,07009,Andance,07,,,070090000A0335,,,2,,,,,,,,,,1,2,Appartement,50,2,,,,,,4.798978,45.241945
2019-88541,2019-04-26,000001,Vente,50000,5049,,RUE DE L HOPITAL,0028,07340,07009,Andance,07,,,070090000A0335,,,1,89.51,,,,,,,,,1,3,Dépendance,,0,,,,,,4.798978,45.241945
2019-88541,2019-04-26,000001,Vente,50000,5048,A,RUE DE L HOPITAL,0028,07340,07009,Andance,07,,,070090000A0336,,,,,,,,,,,,,0,1,Maison,85,4,S,sols,,,85,4.799042,45.24197
2019-88680,2019-05-24,000001,Vente,213000,,,BOIS DE BIENNIER,B006,07340,07009,Andance,07,,,070090000B1408,,,,,,,,,,,,,0,,,,,S,sols,,,49,4.792401,45.237274
2019-88680,2019-05-24,000001,Vente,213000,65,,CHE DES ABRICOTIERS,0104,07340,07009,Andance,07,,,070090000B1411,,,,,,,,,,,,,0,1,Maison,103,3,S,sols,,,488,4.792179,45.237208
2019-88680,2019-05-24,000001,Vente,213000,5517,,LES PARDOULES,B037,07340,07009,Andance,07,,,070090000B1413,,,,,,,,,,,,,0,,,,,S,sols,,,432,4.791999,45.237271
2019-88680,2019-05-24,000001,Vente,213000,,,BOIS DE BIENNIER,B006,07340,07009,Andance,07,,,070090000B1414,,,,,,,,,,,,,0,,,,,S,sols,,,399,4.792716,45.237243
2019-88680,2019-05-24,000001,Vente,213000,,,LA TRENIERE,B048,07340,07009,Andance,07,,,070090000B1416,,,,,,,,,,,,,0,,,,,S,sols,,,7,4.793063,45.237283
2019-88680,2019-05-24,000001,Vente,213000,,,BOIS DE BIENNIER,B006,07340,07009,Andance,07,,,070090000B1418,,,,,,,,,,,,,0,,,,,BT,taillis simples,,,162,4.791913,45.237123
2019-88680,2019-05-24,000001,Vente,213000,,,BOIS DE BIENNIER,B006,07340,07009,Andance,07,,,070090000B1560,,,,,,,,,,,,,0,,,,,VE,vergers,,,99,4.792172,45.237118
2019-88690,2019-05-22,000001,Vente,118000,430,,CHE DE CANSARD,0006,07340,07009,Andance,07,,,070090000C1939,,,,,,,,,,,,,0,1,Maison,93,4,S,sols,,,276,4.80355,45.209299
2019-88838,2019-06-11,000001,Vente,55093,,,LES ESSARTS,B023,07340,07009,Andance,07,,,070090000B0917,,,,,,,,,,,,,0,,,,,L,landes,,,1580,4.788763,45.233812
2019-88838,2019-06-11,000001,Vente,55093,,,BEAUREGARD,B003,07340,07009,Andance,07,,,070090000C0068,,,,,,,,,,,,,0,,,,,VE,vergers,,,2020,4.800109,45.215492
2019-88838,2019-06-11,000001,Vente,55093,,,LES CAILLEES,B009,07340,07009,Andance,07,,,070090000C0091,,,,,,,,,,,,,0,,,,,BT,taillis simples,,,10016,4.794698,45.213257
2019-88838,2019-06-11,000001,Vente,55093,,,LE BESSET,B004,07340,07009,Andance,07,,,070090000C0726,,,,,,,,,,,,,0,,,,,VE,vergers,,,690,4.801259,45.212354
2019-88841,2019-06-13,000001,Vente,55000,2,,CHE DE LA PASSERELLE,0125,07340,07009,Andance,07,,,070090000A1248,,,20,43.34,,,,,,,,,1,2,Appartement,44,2,,,,,,4.798076,45.237256
2019-88841,2019-06-13,000001,Vente,55000,2,,CHE DE LA PASSERELLE,0125,07340,07009,Andance,07,,,070090000A1248,,,37,,,,,,,,,,1,3,Dépendance,,0,,,,,,4.798076,45.237256
2019-88873,2019-06-28,000001,Vente,22500,5108,,RTE NATIONALE 86,0036,07340,07009,Andance,07,,,070090000A0879,,,,,,,,,,,,,0,4,Local industriel. commercial ou assimilé,166,0,S,sols,,,113,4.799194,45.241064
2019-88873,2019-06-28,000001,Vente,22500,5108,,RTE NATIONALE 86,0036,07340,07009,Andance,07,,,070090000A0879,,,,,,,,,,,,,0,1,Maison,80,3,S,sols,,,113,4.799194,45.241064
2019-88873,2019-06-28,000001,Vente,22500,,,LE VILLAGE,B049,07340,07009,Andance,07,,,070090000A0880,,,,,,,,,,,,,0,,,,,S,sols,,,62,4.799288,45.24103
2019-88954,2019-06-20,000001,Vente,235000,23,,RUE DE L HOPITAL,0028,07340,07009,Andance,07,,,070090000A0265,,,,,,,,,,,,,0,1,Maison,133,4,S,sols,,,1162,4.796605,45.240857
2019-88957,2019-06-20,000001,Vente,5827.5,,,CHATEAU MOREL,B014,07340,07009,Andance,07,,,070090000A0725,,,,,,,,,,,,,0,,,,,VE,vergers,,,1295,4.794944,45.241271
2019-89109,2019-07-12,000001,Vente,18000,5147,,RUE DES PAVES,0042,07340,07009,Andance,07,,,070090000A0469,,,,,,,,,,,,,0,1,Maison,70,3,S,sols,,,90,4.798676,45.241012
2019-89121,2019-07-22,000001,Vente,750,,,CUEIL,B022,07340,07009,Andance,07,,,070090000B1327,,,,,,,,,,,,,0,,,,,VE,vergers,,,352,4.800419,45.227752
2019-89121,2019-07-22,000001,Vente,750,,,CUEIL,B022,07340,07009,Andance,07,,,070090000B1328,,,,,,,,,,,,,0,,,,,VE,vergers,,,9,4.800525,45.227426
2019-89121,2019-07-22,000001,Vente,750,,,CUEIL,B022,07340,07009,Andance,07,,,070090000B1330,,,,,,,,,,,,,0,,,,,VE,vergers,,,389,4.800663,45.227131
2019-89131,2019-07-22,000001,Vente,78500,5373,,LA MOTTE,B034,07340,07009,Andance,07,,,070090000B1108,,,33,,51,75,,,,,,,2,2,Appartement,71,4,,,,,,4.79318,45.239172
2019-89131,2019-07-22,000001,Vente,78500,5373,,LA MOTTE,B034,07340,07009,Andance,07,,,070090000B1108,,,14,,,,,,,,,,1,3,Dépendance,,0,,,,,,4.79318,45.239172
2019-89209,2019-07-09,000001,Vente,75000,5373,,LA MOTTE,B034,07340,07009,Andance,07,,,070090000B1108,,,27,,45,,,,,,,,2,2,Appartement,71,4,,,,,,4.79318,45.239172
2019-89209,2019-07-09,000001,Vente,75000,5373,,LA MOTTE,B034,07340,07009,Andance,07,,,070090000B1108,,,8,,,,,,,,,,1,3,Dépendance,,0,,,,,,4.79318,45.239172
2019-89222,2019-07-17,000001,Vente,155000,5164,,RTE NATIONALE 86,0036,07340,07009,Andance,07,,,070090000A0501,,,,,,,,,,,,,0,2,Appartement,51,1,S,sols,,,200,4.798398,45.240266
2019-89222,2019-07-17,000001,Vente,155000,5164,,RTE NATIONALE 86,0036,07340,07009,Andance,07,,,070090000A0501,,,,,,,,,,,,,0,2,Appartement,88,4,S,sols,,,200,4.798398,45.240266
2019-89222,2019-07-17,000001,Vente,155000,5164,,RTE NATIONALE 86,0036,07340,07009,Andance,07,,,070090000A0501,,,,,,,,,,,,,0,2,Appartement,51,1,S,sols,,,200,4.798398,45.240266
2019-89423,2019-08-02,000001,Vente,147000,,,LES PALES,B036,07340,07009,Andance,07,,,070090000B1153,,,,,,,,,,,,,0,,,,,VI,vignes,,,5,4.800662,45.223539
2019-89423,2019-08-02,000001,Vente,147000,,,LES PALES,B036,07340,07009,Andance,07,,,070090000B1335,,,,,,,,,,,,,0,,,,,VI,vignes,,,882,4.800636,45.22325
2019-89423,2019-08-02,000001,Vente,147000,,,LES PALES,B036,07340,07009,Andance,07,,,070090000B1529,,,,,,,,,,,,,0,,,,,T,terres,,,1289,4.801218,45.22335
2019-89423,2019-08-02,000001,Vente,147000,,,LES PALES,B036,07340,07009,Andance,07,,,070090000B1529,,,,,,,,,,,,,0,,,,,S,sols,,,63,4.801218,45.22335
2019-89423,2019-08-02,000001,Vente,147000,350,,CHE DES PALES,0039,07340,07009,Andance,07,,,070090000B1530,,,,,,,,,,,,,0,1,Maison,96,3,S,sols,,,1253,4.80099,45.223227
2019-89427,2019-07-30,000002,Vente,1,,,LE CHATELET,B015,07340,07009,Andance,07,,,070090000A1393,,,,,,,,,,,,,0,,,,,L,landes,,,39,4.799546,45.242937
2019-89427,2019-07-30,000001,Vente,1,4,,RUE DU LT COLONEL MEYRAND,0122,07340,07009,Andance,07,,,070090000A1342,,,,,,,,,,,,,0,,,,,S,sols,,,905,4.799157,45.237639
2019-89446,2019-07-31,000001,Vente,42500,9,,RUE NEUVE,0037,07340,07009,Andance,07,,,070090000A0526,,,5,49.3,,,,,,,,,1,2,Appartement,73,3,,,,,,4.799392,45.240265
2019-89523,2019-08-21,000001,Vente,77900,5151,,IMP DU PAVE,0041,07340,07009,Andance,07,,,070090000A0472,,,,,,,,,,,,,0,1,Maison,130,3,S,sols,,,170,4.798536,45.240944
2019-89694,2019-09-06,000001,Vente,23000,,,LE VILLAGE,B049,07340,07009,Andance,07,,,070090000A0437,,,,,,,,,,,,,0,,,,,S,sols,,,50,4.799785,45.240948
2019-89868,2019-10-15,000001,Vente,141,,,CUEIL,B022,07340,07009,Andance,07,,,070090000B1325,,,,,,,,,,,,,0,,,,,S,sols,,,141,4.800274,45.228232
2019-89969,2019-10-23,000001,Vente,80000,5137,,RUE DES TOURS,0063,07340,07009,Andance,07,,,070090000A0458,,,,,,,,,,,,,0,1,Maison,120,4,S,sols,,,120,4.799156,45.240765
2019-90227,2019-10-25,000001,Vente,160000,210,,CHE DES PECHES,0126,07340,07009,Andance,07,,,070090000C1394,,,,,,,,,,,,,0,1,Maison,110,5,S,sols,,,938,4.802159,45.211571
2019-90227,2019-10-25,000001,Vente,160000,,,LES PECHES,B038,07340,07009,Andance,07,,,070090000C1397,,,,,,,,,,,,,0,,,,,S,sols,,,563,4.80219,45.211435
2019-90227,2019-10-25,000001,Vente,160000,,,LES PECHES,B038,07340,07009,Andance,07,,,070090000C1398,,,,,,,,,,,,,0,,,,,T,terres,,,93,4.802231,45.211368
2019-90227,2019-10-25,000001,Vente,160000,,,LES PECHES,B038,07340,07009,Andance,07,,,070090000C1399,,,,,,,,,,,,,0,,,,,T,terres,,,73,4.802238,45.211351
2019-90299,2019-10-29,000001,Vente,70000,5096,B,PL DES RAVELLINS,0048,07340,07009,Andance,07,,,070090000A0376,,,,,,,,,,,,,0,1,Maison,75,2,S,sols,,,120,4.799893,45.241769
2019-90680,2019-12-13,000001,Vente,150,,,LA TRENIERE,B048,07340,07009,Andance,07,,,070090000B1307,,,,,,,,,,,,,0,,,,,VE,vergers,,,31,4.795658,45.237923
2019-90680,2019-12-13,000001,Vente,150,,,LA TRENIERE,B048,07340,07009,Andance,07,,,070090000B1348,,,,,,,,,,,,,0,,,,,J,jardins,,,31,4.795796,45.237999
2019-90682,2019-12-13,000002,Vente,1,,,LA MOTTE,B034,07340,07009,Andance,07,,,070090000B1576,,,,,,,,,,,,,0,,,,,T,terres,,,60,4.790065,45.238378
2019-90682,2019-12-13,000002,Vente,1,,,LA MOTTE,B034,07340,07009,Andance,07,,,070090000B1580,,,,,,,,,,,,,0,,,,,T,terres,,,2,4.790139,45.238394
2019-90737,2019-12-23,000001,Vente,150000,425,,CHE DE CUEIL MOURACHAT,0117,07340,07009,Andance,07,,,070090000B1273,,,,,,,,,,,,,0,1,Maison,100,4,S,sols,,,720,4.797871,45.227661
2019-90737,2019-12-23,000001,Vente,150000,425,,CHE DE CUEIL MOURACHAT,0117,07340,07009,Andance,07,,,070090000B1273,,,,,,,,,,,,,0,1,Maison,100,4,VE,vergers,,,428,4.797871,45.227661
2019-90758,2019-12-30,000001,Vente,80000,40,,RUE DE L HOPITAL,0028,07340,07009,Andance,07,,,070090000A0713,,,,,,,,,,,,,0,1,Maison,38,1,S,sols,,,125,4.795801,45.240995
