id_mutation,date_mutation,numero_disposition,nature_mutation,valeur_fonciere,adresse_numero,adresse_suffixe,adresse_nom_voie,adresse_code_voie,code_postal,code_commune,nom_commune,code_departement,ancien_code_commune,ancien_nom_commune,id_parcelle,ancien_id_parcelle,numero_volume,lot1_numero,lot1_surface_carrez,lot2_numero,lot2_surface_carrez,lot3_numero,lot3_surface_carrez,lot4_numero,lot4_surface_carrez,lot5_numero,lot5_surface_carrez,nombre_lots,code_type_local,type_local,surface_reelle_bati,nombre_pieces_principales,code_nature_culture,nature_culture,code_nature_culture_speciale,nature_culture_speciale,surface_terrain,longitude,latitude
2019-87719,2019-01-30,000001,Vente,4300,,,LES TREVIS BASSES,B149,07690,07258,Saint-Julien-Vocance,07,,,072580000D0607,,,,,,,,,,,,,0,,,,,BR,futaies résineuses,SAPIN,Sapins ou sapinière,12160,4.457095,45.159096
2019-87779,2019-02-13,000001,Vente,60000,,,LE DEVES,B089,07690,07258,Saint-Julien-Vocance,07,,,072580000F0552,,,,,,,,,,,,,0,,,,,L,landes,,,29500,4.474673,45.170518
2019-87779,2019-02-13,000001,Vente,60000,,,LE DEVES,B089,07690,07258,Saint-Julien-Vocance,07,,,072580000F0553,,,,,,,,,,,,,0,,,,,BR,futaies résineuses,PIN,Pins,12375,4.47343,45.170365
2019-87779,2019-02-13,000001,Vente,60000,,,LE DEVES,B089,07690,07258,Saint-Julien-Vocance,07,,,072580000F0554,,,,,,,,,,,,,0,,,,,BS,taillis sous futaie,,,490,4.474052,45.168973
2019-87779,2019-02-13,000001,Vente,60000,,,LE DEVES,B089,07690,07258,Saint-Julien-Vocance,07,,,072580000F0555,,,,,,,,,,,,,0,,,,,BS,taillis sous futaie,,,7953,4.474736,45.168954
2019-87779,2019-02-13,000001,Vente,60000,,,LE DEVES,B089,07690,07258,Saint-Julien-Vocance,07,,,072580000F0556,,,,,,,,,,,,,0,,,,,L,landes,,,1640,4.474835,45.167825
2019-87779,2019-02-13,000001,Vente,60000,,,LE DEVES,B089,07690,07258,Saint-Julien-Vocance,07,,,072580000F0557,,,,,,,,,,,,,0,,,,,BR,futaies résineuses,PIN,Pins,630,4.475977,45.167345
2019-87779,2019-02-13,000001,Vente,60000,,,LE DEVES,B089,07690,07258,Saint-Julien-Vocance,07,,,072580000F0558,,,,,,,,,,,,,0,,,,,BR,futaies résineuses,PIN,Pins,27625,4.475867,45.168146
2019-87779,2019-02-13,000001,Vente,60000,,,LE DEVES,B089,07690,07258,Saint-Julien-Vocance,07,,,072580000F0559,,,,,,,,,,,,,0,,,,,L,landes,,,20093,4.476774,45.168477
2019-87779,2019-02-13,000001,Vente,60000,,,LE DEVES,B089,07690,07258,Saint-Julien-Vocance,07,,,072580000F0560,,,,,,,,,,,,,0,,,,,L,landes,,,8438,4.478091,45.167429
2019-87779,2019-02-13,000001,Vente,60000,,,LE DEVES,B089,07690,07258,Saint-Julien-Vocance,07,,,072580000F0561,,,,,,,,,,,,,0,,,,,BS,taillis sous futaie,,,11313,4.47953,45.166773
2019-87779,2019-02-13,000001,Vente,60000,,,LES BLACHES,B059,07690,07258,Saint-Julien-Vocance,07,,,072580000F0612,,,,,,,,,,,,,0,,,,,BS,taillis sous futaie,,,3775,4.473709,45.168752
2019-87779,2019-02-13,000001,Vente,60000,,,LES BLACHES,B059,07690,07258,Saint-Julien-Vocance,07,,,072580000F0615,,,,,,,,,,,,,0,,,,,BS,taillis sous futaie,,,7990,4.47278,45.169577
2019-87785,2019-02-16,000001,Vente,7034,,,LAMATE NORD,B111,07690,07258,Saint-Julien-Vocance,07,,,072580000F0029,,,,,,,,,,,,,0,,,,,BR,futaies résineuses,SAPIN,Sapins ou sapinière,15617,4.478042,45.185529
2019-87785,2019-02-16,000001,Vente,7034,,,LAMATE NORD,B111,07690,07258,Saint-Julien-Vocance,07,,,072580000F0038,,,,,,,,,,,,,0,,,,,BR,futaies résineuses,SAPIN,Sapins ou sapinière,10390,4.479035,45.187408
2019-87785,2019-02-16,000001,Vente,7034,,,LAMATE NORD,B111,07690,07258,Saint-Julien-Vocance,07,,,072580000F0039,,,,,,,,,,,,,0,,,,,BR,futaies résineuses,SAPIN,Sapins ou sapinière,9163,4.478993,45.188699
2019-88142,2019-03-06,000001,Vente,1700,,,LA SELLE,B045,07690,07258,Saint-Julien-Vocance,07,,,072580000A0136,,,,,,,,,,,,,0,,,,,BR,futaies résineuses,PIN,Pins,2156,4.495262,45.179387
2019-88142,2019-03-06,000001,Vente,1700,,,LA SELLE,B045,07690,07258,Saint-Julien-Vocance,07,,,072580000A0137,,,,,,,,,,,,,0,,,,,BR,futaies résineuses,PIN,Pins,6390,4.495751,45.179482
2019-88142,2019-03-06,000001,Vente,1700,,,LA SELLE,B045,07690,07258,Saint-Julien-Vocance,07,,,072580000A0138,,,,,,,,,,,,,0,,,,,BR,futaies résineuses,PIN,Pins,1765,4.495702,45.179719
2019-88266,2019-03-29,000001,Vente,25000,,,PRABLANC,B039,07690,07258,Saint-Julien-Vocance,07,,,072580000B0286,,,,,,,,,,,,,0,,,,,L,landes,,,1790,4.520787,45.183208
2019-88266,2019-03-29,000001,Vente,25000,,,PRABLANC,B039,07690,07258,Saint-Julien-Vocance,07,,,072580000B0292,,,,,,,,,,,,,0,,,,,L,landes,,,800,4.521348,45.183039
2019-88266,2019-03-29,000001,Vente,25000,,,PRABLANC,B039,07690,07258,Saint-Julien-Vocance,07,,,072580000B0299,,,,,,,,,,,,,0,,,,,L,landes,,,2310,4.521266,45.183425
2019-88266,2019-03-29,000001,Vente,25000,5017,,PRABLANC,B039,07690,07258,Saint-Julien-Vocance,07,,,072580000B0337,,,,,,,,,,,,,0,1,Maison,40,2,S,sols,,,250,4.519394,45.183423
2019-88268,2019-03-29,000001,Vente,13000,,,PRABLANC,B039,07690,07258,Saint-Julien-Vocance,07,,,072580000B0348,,,,,,,,,,,,,0,,,,,J,jardins,,,181,4.51865,45.183934
2019-88268,2019-03-29,000001,Vente,13000,,,PRABLANC,B039,07690,07258,Saint-Julien-Vocance,07,,,072580000B0371,,,,,,,,,,,,,0,,,,,L,landes,,,1500,4.51905,45.184989
2019-88436,2019-04-25,000001,Vente,1500,,,MONTEIL,B033,07690,07258,Saint-Julien-Vocance,07,,,072580000F0432,,,,,,,,,,,,,0,,,,,T,terres,,,1182,4.493423,45.172835
2019-88436,2019-04-25,000001,Vente,1500,,,MONTEIL,B033,07690,07258,Saint-Julien-Vocance,07,,,072580000F0433,,,,,,,,,,,,,0,,,,,BS,taillis sous futaie,,,1316,4.493133,45.172866
2019-88436,2019-04-25,000001,Vente,1500,,,MONTEIL,B033,07690,07258,Saint-Julien-Vocance,07,,,072580000F0434,,,,,,,,,,,,,0,,,,,BR,futaies résineuses,PIN,Pins,3091,4.493028,45.173193
2019-88449,2019-04-16,000001,Vente,5000,,,CHIRATES,B075,07690,07258,Saint-Julien-Vocance,07,,,072580000B0396,,,,,,,,,,,,,0,,,,,BR,futaies résineuses,SAPIN,Sapins ou sapinière,6700,4.502205,45.168585
2019-88449,2019-04-16,000001,Vente,5000,,,CHIRATES,B075,07690,07258,Saint-Julien-Vocance,07,,,072580000B0398,,,,,,,,,,,,,0,,,,,BR,futaies résineuses,SAPIN,Sapins ou sapinière,790,4.501513,45.169859
2019-88449,2019-04-16,000001,Vente,5000,,,LA RASE,B131,07690,07258,Saint-Julien-Vocance,07,,,072580000C0140,,,,,,,,,,,,,0,,,,,B,bois,,,4692,4.493053,45.170269
2019-88449,2019-04-16,000001,Vente,5000,,,LA RASE,B131,07690,07258,Saint-Julien-Vocance,07,,,072580000C0140,,,,,,,,,,,,,0,,,,,BR,futaies résineuses,SAPIN,Sapins ou sapinière,1173,4.493053,45.170269
2019-88513,2019-05-06,000001,Vente,43000,5112,,MALESCOS,B031,07690,07258,Saint-Julien-Vocance,07,,,07258000AB0238,,,,,,,,,,,,,0,1,Maison,80,2,S,sols,,,177,4.502039,45.1745
2019-88729,2019-05-27,000001,Vente,120000,5044,,LES BARRAQUES,B002,07690,07258,Saint-Julien-Vocance,07,,,072580000D0046,,,,,,,,,,,,,0,1,Maison,200,4,S,sols,,,525,4.449018,45.145037
2019-88729,2019-05-27,000001,Vente,120000,,,LES BARRAQUES,B002,07690,07258,Saint-Julien-Vocance,07,,,072580000D0047,,,,,,,,,,,,,0,,,,,S,sols,,,220,4.449185,45.144905
2019-88729,2019-05-27,000001,Vente,120000,,,LES BARRAQUES,B002,07690,07258,Saint-Julien-Vocance,07,,,072580000D0048,,,,,,,,,,,,,0,,,,,P,prés,,,1870,4.449442,45.145289
2019-88811,2019-06-05,000001,Vente,31000,5092,,CLAVET,B013,07690,07258,Saint-Julien-Vocance,07,,,07258000AB0281,,,,,,,,,,,,,0,1,Maison,60,3,S,sols,,,205,4.499665,45.173253
2019-88927,2019-05-29,000001,Vente,11000,,,CHIRATES,B075,07690,07258,Saint-Julien-Vocance,07,,,072580000B0392,,,,,,,,,,,,,0,,,,,BR,futaies résineuses,SAPIN,Sapins ou sapinière,5160,4.500054,45.169013
2019-88927,2019-05-29,000001,Vente,11000,,,CHIRATES,B075,07690,07258,Saint-Julien-Vocance,07,,,072580000B0406,,,,,,,,,,,,,0,,,,,L,landes,,,1586,4.497947,45.169175
2019-88927,2019-05-29,000001,Vente,11000,,,RASES,B132,07690,07258,Saint-Julien-Vocance,07,,,072580000B0436,,,,,,,,,,,,,0,,,,,BR,futaies résineuses,SAPIN,Sapins ou sapinière,7250,4.502251,45.1713
2019-88927,2019-05-29,000001,Vente,11000,,,MARTIRAS,B119,07690,07258,Saint-Julien-Vocance,07,,,072580000C0233,,,,,,,,,,,,,0,,,,,BR,futaies résineuses,SAPIN,Sapins ou sapinière,4203,4.496327,45.159334
2019-88927,2019-05-29,000001,Vente,11000,,,MARTIRAS,B119,07690,07258,Saint-Julien-Vocance,07,,,072580000C0238,,,,,,,,,,,,,0,,,,,BR,futaies résineuses,SAPIN,Sapins ou sapinière,3790,4.496047,45.161374
2019-89137,2019-07-22,000001,Vente,2500,,,GRAND BOIS,B099,07690,07258,Saint-Julien-Vocance,07,,,072580000B0140,,,,,,,,,,,,,0,,,,,BR,futaies résineuses,SAPIN,Sapins ou sapinière,4547,4.52016,45.167643
2019-89618,2019-08-23,000001,Vente,1140,,,CUL BLANC,B088,07690,07258,Saint-Julien-Vocance,07,,,072580000C0665,,,,,,,,,,,,,0,,,,,BS,taillis sous futaie,,,10071,4.495284,45.151066
2019-89725,2019-09-13,000001,Vente,2000,,,CHIRATES,B075,07690,07258,Saint-Julien-Vocance,07,,,072580000B0392,,,,,,,,,,,,,0,,,,,BR,futaies résineuses,SAPIN,Sapins ou sapinière,5160,4.500054,45.169013
2019-89725,2019-09-13,000001,Vente,2000,,,CHIRATES,B075,07690,07258,Saint-Julien-Vocance,07,,,072580000B0406,,,,,,,,,,,,,0,,,,,L,landes,,,1586,4.497947,45.169175
2019-89748,2019-09-13,000001,Vente,1800,,,CERVAUX,B009,07690,07258,Saint-Julien-Vocance,07,,,072580000A0259,,,,,,,,,,,,,0,,,,,BR,futaies résineuses,SAPIN,Sapins ou sapinière,10220,4.516775,45.187606
2019-89748,2019-09-13,000001,Vente,1800,,,ROCHEDRAS,B138,07690,07258,Saint-Julien-Vocance,07,,,072580000A0318,,,,,,,,,,,,,0,,,,,BR,futaies résineuses,SAPIN,Sapins ou sapinière,3660,4.514019,45.185663
2019-89760,2019-09-13,000001,Vente,4000,,,HAM DE BAUBICHON,B101,07690,07258,Saint-Julien-Vocance,07,,,07258000AB0070,,,,,,,,,,,,,0,,,,,L,landes,,,1235,4.49889,45.174148
2019-89760,2019-09-13,000001,Vente,4000,,,HAM DE BAUBICHON,B101,07690,07258,Saint-Julien-Vocance,07,,,07258000AB0071,,,,,,,,,,,,,0,,,,,L,landes,,,198,4.498789,45.174401
2019-90103,2019-11-04,000001,Vente,2500,,,SUC DU PET POINTU,B147,07690,07258,Saint-Julien-Vocance,07,,,072580000D0074,,,,,,,,,,,,,0,,,,,BR,futaies résineuses,SAPIN,Sapins ou sapinière,12922,4.448582,45.153627
2019-90368,2019-11-20,000001,Vente,550,,,FONZAL DE GRANICHE,B092,07690,07258,Saint-Julien-Vocance,07,,,072580000F0345,,,,,,,,,,,,,0,,,,,BR,futaies résineuses,SAPIN,Sapins ou sapinière,4360,4.477498,45.172854
2019-90368,2019-11-20,000001,Vente,550,,,FONZAL DE GRANICHE,B092,07690,07258,Saint-Julien-Vocance,07,,,072580000F0346,,,,,,,,,,,,,0,,,,,BR,futaies résineuses,PIN,Pins,570,4.477794,45.17242
2019-90370,2019-11-20,000001,Vente,300,,,FONZAL DE GRANICHE,B092,07690,07258,Saint-Julien-Vocance,07,,,072580000F0330,,,,,,,,,,,,,0,,,,,BR,futaies résineuses,SAPIN,Sapins ou sapinière,1040,4.47619,45.17344
2019-90571,2019-12-13,000003,Vente,225,,,LES BARRAQUES,B002,07690,07258,Saint-Julien-Vocance,07,,,072580000D0774,,,,,,,,,,,,,0,,,,,L,landes,,,14,4.443678,45.141684
