id_mutation,date_mutation,numero_disposition,nature_mutation,valeur_fonciere,adresse_numero,adresse_suffixe,adresse_nom_voie,adresse_code_voie,code_postal,code_commune,nom_commune,code_departement,ancien_code_commune,ancien_nom_commune,id_parcelle,ancien_id_parcelle,numero_volume,lot1_numero,lot1_surface_carrez,lot2_numero,lot2_surface_carrez,lot3_numero,lot3_surface_carrez,lot4_numero,lot4_surface_carrez,lot5_numero,lot5_surface_carrez,nombre_lots,code_type_local,type_local,surface_reelle_bati,nombre_pieces_principales,code_nature_culture,nature_culture,code_nature_culture_speciale,nature_culture_speciale,surface_terrain,longitude,latitude
2019-90955,2019-01-23,000001,Vente,133000,5104,,LE PARADIS,B040,08090,08162,Fagnon,08,,,081620000A0115,,,,,,,,,,,,,0,1,Maison,135,5,S,sols,,,1012,4.639994,49.739646
2019-90956,2019-01-16,000001,Vente,120000,8,,RUE DES SEPT FONTAINES,0050,08090,08162,Fagnon,08,,,081620000C0062,,,,,,,,,,,,,0,1,Maison,72,3,S,sols,,,825,4.63558,49.739237
2019-90956,2019-01-16,000001,Vente,120000,,,LE VILLAGE,B058,08090,08162,Fagnon,08,,,081620000C0229,,,,,,,,,,,,,0,,,,,S,sols,,,81,4.635676,49.739358
2019-91043,2019-01-22,000001,Vente,8000,,,LE VILLAGE,B058,08090,08162,Fagnon,08,,,081620000C0083,,,,,,,,,,,,,0,,,,,B,bois,,,316,4.637189,49.737731
2019-92398,2019-07-24,000001,Vente,18000,,,LE VILLAGE,B058,08090,08162,Fagnon,08,,,081620000C0389,,,,,,,,,,,,,0,,,,,S,sols,,,99,4.636558,49.73717
2019-92398,2019-07-24,000001,Vente,18000,,,LE VILLAGE,B058,08090,08162,Fagnon,08,,,081620000C0413,,,,,,,,,,,,,0,,,,,P,prés,,,105,4.636334,49.737262
2019-93475,2019-12-12,000001,Vente,208500,5063,,ENTRE LES DEUX MOULINS,B026,08090,08162,Fagnon,08,,,081620000A0118,,,,,,,,,,,,,0,1,Maison,95,6,P,prés,,,1111,4.643918,49.741472
2019-93475,2019-12-12,000001,Vente,208500,5063,,ENTRE LES DEUX MOULINS,B026,08090,08162,Fagnon,08,,,081620000A0118,,,,,,,,,,,,,0,1,Maison,95,6,S,sols,,,1397,4.643918,49.741472
2019-93596,2019-12-23,000001,Vente,550000,,,LES TERRES DE L ARBRE,B052,08090,08162,Fagnon,08,,,081620000A0021,,,,,,,,,,,,,0,,,,,AG,terrains d'agrément,,,87080,4.6309,49.745767
2019-93596,2019-12-23,000001,Vente,550000,,,SEPT FONTAINES,B048,08090,08162,Fagnon,08,,,081620000A0072,,,,,,,,,,,,,0,,,,,AG,terrains d'agrément,,,6895,4.637939,49.742317
2019-93596,2019-12-23,000001,Vente,550000,,,SEPT FONTAINES,B048,08090,08162,Fagnon,08,,,081620000A0073,,,,,,,,,,,,,0,,,,,AG,terrains d'agrément,,,44275,4.636639,49.743106
2019-93596,2019-12-23,000001,Vente,550000,,,SEPT FONTAINES,B048,08090,08162,Fagnon,08,,,081620000A0076,,,,,,,,,,,,,0,,,,,S,sols,,,4670,4.64059,49.745068
2019-93596,2019-12-23,000001,Vente,550000,,,SEPT FONTAINES,B048,08090,08162,Fagnon,08,,,081620000A0086,,,,,,,,,,,,,0,,,,,AG,terrains d'agrément,,,2680,4.638809,49.745522
2019-93596,2019-12-23,000001,Vente,550000,,,SEPT FONTAINES,B048,08090,08162,Fagnon,08,,,081620000A0089,,,,,,,,,,,,,0,,,,,S,sols,,,1090,4.636531,49.744252
2019-93596,2019-12-23,000001,Vente,550000,,,SEPT FONTAINES,B048,08090,08162,Fagnon,08,,,081620000A0123,,,,,,,,,,,,,0,,,,,S,sols,,,1737,4.637614,49.746018
2019-93596,2019-12-23,000001,Vente,550000,,,SEPT FONTAINES,B048,08090,08162,Fagnon,08,,,081620000A0125,,,,,,,,,,,,,0,,,,,S,sols,,,143,4.637569,49.746161
2019-93596,2019-12-23,000001,Vente,550000,,,SEPT FONTAINES,B048,08090,08162,Fagnon,08,,,081620000A0126,,,,,,,,,,,,,0,,,,,S,sols,,,94,4.636863,49.745755
2019-93596,2019-12-23,000001,Vente,550000,,,SEPT FONTAINES,B048,08090,08162,Fagnon,08,,,081620000A0128,,,,,,,,,,,,,0,,,,,S,sols,,,1315,4.636771,49.745635
2019-93596,2019-12-23,000001,Vente,550000,,,SEPT FONTAINES,B048,08090,08162,Fagnon,08,,,081620000A0130,,,,,,,,,,,,,0,,,,,S,sols,,,15778,4.637018,49.745033
2019-93596,2019-12-23,000001,Vente,550000,,,SEPT FONTAINES,B048,08090,08162,Fagnon,08,,,081620000A0131,,,,,,,,,,,,,0,,,,,S,sols,,,3990,4.636041,49.744844
2019-93596,2019-12-23,000001,Vente,550000,,,SEPT FONTAINES,B048,08090,08162,Fagnon,08,,,081620000A0145,,,,,,,,,,,,,0,,,,,AG,terrains d'agrément,,,154595,4.639548,49.744251
2019-93596,2019-12-23,000001,Vente,550000,,,SEPT FONTAINES,B048,08090,08162,Fagnon,08,,,081620000A0163,,,,,,,,,,,,,0,,,,,AG,terrains d'agrément,,,63307,4.638233,49.740491
2019-93596,2019-12-23,000001,Vente,550000,5055,,SEPT FONTAINES,B048,08090,08162,Fagnon,08,,,081620000A0167,,,,,,,,,,,,,0,4,Local industriel. commercial ou assimilé,854,0,S,sols,,,678,4.637244,49.744962
2019-93596,2019-12-23,000001,Vente,550000,5055,,SEPT FONTAINES,B048,08090,08162,Fagnon,08,,,081620000A0167,,,,,,,,,,,,,0,1,Maison,213,6,S,sols,,,678,4.637244,49.744962
2019-93596,2019-12-23,000001,Vente,550000,5056,,SEPT FONTAINES,B048,08090,08162,Fagnon,08,,,081620000A0168,,,,,,,,,,,,,0,4,Local industriel. commercial ou assimilé,42,0,S,sols,,,185,4.636697,49.744387
2019-93596,2019-12-23,000001,Vente,550000,,,SEPT FONTAINES,B048,08090,08162,Fagnon,08,,,081620000A0169,,,,,,,,,,,,,0,,,,,S,sols,,,170,4.635759,49.744483
2019-93596,2019-12-23,000001,Vente,550000,,,SEPT FONTAINES,B048,08090,08162,Fagnon,08,,,081620000A0170,,,,,,,,,,,,,0,,,,,S,sols,,,14,4.638813,49.745723
2019-93596,2019-12-23,000001,Vente,550000,5000,,LA COTE DES NOYERS,B012,08090,08162,Fagnon,08,,,08162000YB0034,,,,,,,,,,,,,0,4,Local industriel. commercial ou assimilé,,0,AG,terrains d'agrément,,,138774,4.633128,49.744861
