id_mutation,date_mutation,numero_disposition,nature_mutation,valeur_fonciere,adresse_numero,adresse_suffixe,adresse_nom_voie,adresse_code_voie,code_postal,code_commune,nom_commune,code_departement,ancien_code_commune,ancien_nom_commune,id_parcelle,ancien_id_parcelle,numero_volume,lot1_numero,lot1_surface_carrez,lot2_numero,lot2_surface_carrez,lot3_numero,lot3_surface_carrez,lot4_numero,lot4_surface_carrez,lot5_numero,lot5_surface_carrez,nombre_lots,code_type_local,type_local,surface_reelle_bati,nombre_pieces_principales,code_nature_culture,nature_culture,code_nature_culture_speciale,nature_culture_speciale,surface_terrain,longitude,latitude
2019-90932,2019-01-17,000001,Echange,156668.22,,,LES ZIVAGES,B040,08170,08222,Haybes,08,,,08222000AK0235,,,,,,,,,,,,,0,,,,,AB,terrains a bâtir,,,580,4.70824,50.000566
2019-90932,2019-01-17,000001,Echange,156668.22,5931,,LES ZIVAGES,B040,08170,08222,Haybes,08,,,08222000AK0236,,,,,,,,,,,,,0,4,Local industriel. commercial ou assimilé,,,AB,terrains a bâtir,,,4779,4.709021,50.000592
2019-90932,2019-01-17,000001,Echange,156668.22,5931,,LES ZIVAGES,B040,08170,08222,Haybes,08,,,08222000AK0236,,,,,,,,,,,,,0,4,Local industriel. commercial ou assimilé,,,AB,terrains a bâtir,,,4779,4.709021,50.000592
2019-90932,2019-01-17,000001,Echange,156668.22,,,LES ZIVAGES,B040,08170,08222,Haybes,08,,,08222000AK0237,,,,,,,,,,,,,0,,,,,S,sols,,,176,4.708784,50.000969
2019-91039,2019-02-05,000001,Vente,4000,5099,,RUE PIERRE CURIE,0160,08170,08222,Haybes,08,,,08222000AE0534,,,,,,,,,,,,,0,3,Dépendance,,0,S,sols,,,19,4.707785,50.01056
2019-91097,2019-02-04,000001,Vente,18000,5210,,LE VILLAGE,B038,08170,08222,Haybes,08,,,08222000AE0306,,,,,,,,,,,,,0,3,Dépendance,,0,S,sols,,,56,4.708723,50.009331
2019-91097,2019-02-04,000001,Vente,18000,5210,,LE VILLAGE,B038,08170,08222,Haybes,08,,,08222000AE0306,,,,,,,,,,,,,0,3,Dépendance,,0,S,sols,,,56,4.708723,50.009331
2019-91097,2019-02-04,000001,Vente,18000,5210,,LE VILLAGE,B038,08170,08222,Haybes,08,,,08222000AE0306,,,,,,,,,,,,,0,3,Dépendance,,0,S,sols,,,56,4.708723,50.009331
2019-91097,2019-02-04,000001,Vente,18000,,,LE VILLAGE,B038,08170,08222,Haybes,08,,,08222000AE0491,,,,,,,,,,,,,0,,,,,S,sols,,,129,4.708838,50.009317
2019-91124,2019-02-16,000001,Vente,29000,,,FOLEMPRISE,B019,08170,08222,Haybes,08,,,08222000AD0395,,,,,,,,,,,,,0,,,,,VE,vergers,,,734,4.704653,50.005477
2019-91124,2019-02-16,000001,Vente,29000,,,FOLEMPRISE,B019,08170,08222,Haybes,08,,,08222000AD0397,,,,,,,,,,,,,0,,,,,S,sols,,,77,4.704532,50.005451
2019-91124,2019-02-16,000001,Vente,29000,,,FOLEMPRISE,B019,08170,08222,Haybes,08,,,08222000AD0398,,,,,,,,,,,,,0,,,,,S,sols,,,20,4.704547,50.005382
2019-91225,2019-02-14,000001,Vente,45000,9,,RUE VICTOR HUGO,0200,08170,08222,Haybes,08,,,08222000AE0307,,,,,,,,,,,,,0,1,Maison,55,3,S,sols,,,103,4.708817,50.009385
2019-91317,2019-02-25,000001,Vente,166500,6,,PL DE LA CHARITE,0030,08170,08222,Haybes,08,,,08222000AE0302,,,,,,,,,,,,,0,1,Maison,118,5,S,sols,,,255,4.709099,50.009765
2019-91323,2019-02-25,000001,Vente,5000,5876,,RUE VICTOR HUGO,0200,08170,08222,Haybes,08,,,08222000AE0500,,,,,,,,,,,,,0,3,Dépendance,,0,S,sols,,,25,4.708739,50.009527
2019-91408,2019-03-11,000001,Vente,10000,,,FOLEMPRISE,B019,08170,08222,Haybes,08,,,08222000AD0115,,,,,,,,,,,,,0,,,,,J,jardins,,,255,4.706266,50.006819
2019-91408,2019-03-11,000001,Vente,10000,5610,,FOLEMPRISE,B019,08170,08222,Haybes,08,,,08222000AD0116,,,,,,,,,,,,,0,3,Dépendance,,0,S,sols,,,43,4.706315,50.006829
2019-91442,2019-03-21,000001,Vente,100000,46,,RUE MADAME DE CORMONT,0115,08170,08222,Haybes,08,,,08222000AK0062,,,,,,,,,,,,,0,1,Maison,66,4,S,sols,,,607,4.711084,50.00298
2019-91464,2019-02-27,000002,Vente,170000,5686,A,LES ZIVAGES,B040,08170,08222,Haybes,08,,,08222000AK0457,,,,,,,,,,,,,0,1,Maison,115,5,,,,,,4.70958,50.002693
2019-91467,2019-03-29,000001,Vente,21000,9,,RUE SAINT LOUIS,0180,08170,08222,Haybes,08,,,08222000AC0364,,,,,,,,,,,,,0,1,Maison,82,3,S,sols,,,161,4.704522,50.009088
2019-91519,2019-03-28,000001,Vente,10000,5078,,LE VILLAGE,B038,08170,08222,Haybes,08,,,08222000AE0391,,,,,,,,,,,,,0,3,Dépendance,,0,S,sols,,,115,4.710278,50.010247
2019-91586,2019-04-09,000001,Vente,42500,,,LE VILLAGE,B038,08170,08222,Haybes,08,,,08222000AE0369,,,,,,,,,,,,,0,,,,,S,sols,,,109,4.708325,50.010597
2019-91586,2019-04-09,000001,Vente,42500,45,,RUE ANDRE CUNIN,0041,08170,08222,Haybes,08,,,08222000AE0371,,,,,,,,,,,,,0,1,Maison,48,3,S,sols,,,31,4.708211,50.010401
2019-91706,2019-05-06,000001,Vente,72500,8,,CITE SAINT PIERRE,B014,08170,08222,Haybes,08,,,08222000AD0039,,,,,,,,,,,,,0,1,Maison,98,5,S,sols,,,121,4.703888,50.004939
2019-91913,2019-05-22,000001,Vente,38147,,,LES BOIS,B002,08170,08222,Haybes,08,,,08222000AL0292,,,,,,,,,,,,,0,,,,,L,landes,,,327,4.702107,49.995384
2019-91913,2019-05-22,000001,Vente,38147,,,LES BOIS,B002,08170,08222,Haybes,08,,,08222000AL0294,,,,,,,,,,,,,0,,,,,S,sols,,,164,4.702416,49.995277
2019-91913,2019-05-22,000001,Vente,38147,,,LES BOIS,B002,08170,08222,Haybes,08,,,08222000AL0295,,,,,,,,,,,,,0,,,,,S,sols,,,329,4.702098,49.995303
2019-91913,2019-05-22,000001,Vente,38147,,,LES BOIS,B002,08170,08222,Haybes,08,,,08222000AL0297,,,,,,,,,,,,,0,,,,,S,sols,,,163,4.702443,49.995126
2019-91913,2019-05-22,000001,Vente,38147,5923,,LES BOIS,B002,08170,08222,Haybes,08,,,08222000AL0298,,,,,,,,,,,,,0,4,Local industriel. commercial ou assimilé,315,0,S,sols,,,1932,4.702085,49.995035
2019-91926,2019-06-04,000003,Vente,30000,,,CLOS BOURDON,B015,08170,08222,Haybes,08,,,08222000AB0457,,,,,,,,,,,,,0,,,,,P,prés,,,113,4.701692,50.00038
2019-91955,2019-06-06,000001,Vente,95000,,,LE VILLAGE,B038,08170,08222,Haybes,08,,,08222000AE0271,,,,,,,,,,,,,0,,,,,VE,vergers,,,538,4.711178,50.00944
2019-91955,2019-06-06,000001,Vente,95000,32,,RUE DU DOCTEUR BONNET,0048,08170,08222,Haybes,08,,,08222000AE0272,,,,,,,,,,,,,0,1,Maison,100,4,S,sols,,,412,4.711219,50.009846
2019-92098,2019-06-19,000001,Vente,47952,17,,QUAI DU 18E CHASSEUR,0040,08170,08222,Haybes,08,,,08222000AC0594,,,,,,,,,,,,,0,1,Maison,120,5,S,sols,,,376,4.70371,50.010141
2019-92152,2019-07-05,000001,Vente,75000,21,,QUAI DU 18E CHASSEUR,0040,08170,08222,Haybes,08,,,08222000AC0031,,,,,,,,,,,,,0,1,Maison,82,4,S,sols,,,976,4.703188,50.009909
2019-92209,2019-07-04,000001,Vente,12472,,,LE CHARNOY,B011,08170,08222,Haybes,08,,,08222000AE0175,,,,,,,,,,,,,0,,,,,VE,vergers,,,2832,4.711723,50.005399
2019-92209,2019-07-04,000001,Vente,12472,,,LE CHARNOY,B011,08170,08222,Haybes,08,,,08222000AE0176,,,,,,,,,,,,,0,,,,,S,sols,,,56,4.711483,50.005423
2019-92209,2019-07-04,000001,Vente,12472,,,LE CHARNOY,B011,08170,08222,Haybes,08,,,08222000AE0186,,,,,,,,,,,,,0,,,,,P,prés,,,230,4.711201,50.005518
2019-92251,2019-07-05,000001,Vente,119700,,,LE VILLAGE,B038,08170,08222,Haybes,08,,,08222000AE0262,,,,,,,,,,,,,0,,,,,P,prés,,,489,4.711696,50.009753
2019-92251,2019-07-05,000001,Vente,119700,2,,PL DU VIVIER,0210,08170,08222,Haybes,08,,,08222000AE0434,,,,,,,,,,,,,0,1,Maison,120,4,S,sols,,,197,4.712012,50.009729
2019-92254,2019-07-05,000001,Vente,800,,,LE CHARNOY,B011,08170,08222,Haybes,08,,,08222000AE0159,,,,,,,,,,,,,0,,,,,P,prés,,,470,4.713379,50.007066
2019-92467,2019-07-22,000001,Vente,25000,5895,,FOLEMPRISE,B019,08170,08222,Haybes,08,,,08222000AD0146,,,,,,,,,,,,,0,3,Dépendance,,0,S,sols,,,232,4.705374,50.004446
2019-92474,2019-07-18,000001,Vente,40000,19,,RUE DE LA CENSE,0024,08170,08222,Haybes,08,,,08222000AD0102,,,,,,,,,,,,,0,1,Maison,110,3,S,sols,,,63,4.706312,50.007317
2019-92673,2019-08-23,000001,Vente,85000,15,,RUE ANDRE CUNIN,0041,08170,08222,Haybes,08,,,08222000AC0085,,,,,,,,,,,,,0,4,Local industriel. commercial ou assimilé,66,0,S,sols,,,79,4.706508,50.010304
2019-92673,2019-08-23,000001,Vente,85000,15,,RUE ANDRE CUNIN,0041,08170,08222,Haybes,08,,,08222000AC0085,,,,,,,,,,,,,0,1,Maison,38,0,S,sols,,,79,4.706508,50.010304
2019-92811,2019-09-18,000001,Vente,5000,,,LE VIVIER,B039,08170,08222,Haybes,08,,,08222000AE0051,,,,,,,,,,,,,0,,,,,S,sols,,,88,4.712751,50.009052
2019-92811,2019-09-18,000001,Vente,5000,20,,PL DU VIVIER,0210,08170,08222,Haybes,08,,,08222000AE0052,,,,,,,,,,,,,0,1,Maison,43,3,S,sols,,,34,4.712707,50.009182
2019-92811,2019-09-18,000001,Vente,5000,,,LE VIVIER,B039,08170,08222,Haybes,08,,,08222000AE0054,,,,,,,,,,,,,0,,,,,S,sols,,,29,4.712781,50.009198
2019-92811,2019-09-18,000001,Vente,5000,,,LE VIVIER,B039,08170,08222,Haybes,08,,,08222000AE0056,,,,,,,,,,,,,0,,,,,L,landes,,,136,4.712884,50.009077
2019-92811,2019-09-18,000001,Vente,5000,20,,PL DU VIVIER,0210,08170,08222,Haybes,08,,,08222000AE0057,,,,,,,,,,,,,0,3,Dépendance,,0,S,sols,,,39,4.712836,50.009225
2019-92818,2019-09-16,000001,Vente,280000,,,LE RIDOUX,B031,08170,08222,Haybes,08,,,08222000AN0028,,,,,,,,,,,,,0,,,,,J,jardins,,,941,4.729539,50.03604
2019-92818,2019-09-16,000001,Vente,280000,,,LE RIDOUX,B031,08170,08222,Haybes,08,,,08222000AN0029,,,,,,,,,,,,,0,,,,,J,jardins,,,863,4.729442,50.035848
2019-92818,2019-09-16,000001,Vente,280000,,,LE RIDOUX,B031,08170,08222,Haybes,08,,,08222000AN0030,,,,,,,,,,,,,0,,,,,J,jardins,,,512,4.72916,50.035941
2019-92818,2019-09-16,000001,Vente,280000,,,LE RIDOUX,B031,08170,08222,Haybes,08,,,08222000AN0031,,,,,,,,,,,,,0,,,,,S,sols,,,418,4.729945,50.035987
2019-92818,2019-09-16,000001,Vente,280000,5002,A,LE RIDOUX,B031,08170,08222,Haybes,08,,,08222000AN0032,,,,,,,,,,,,,0,1,Maison,125,3,S,sols,,,350,4.729867,50.035785
2019-92818,2019-09-16,000001,Vente,280000,,,LE RIDOUX,B031,08170,08222,Haybes,08,,,08222000AN0033,,,,,,,,,,,,,0,,,,,VE,vergers,,,457,4.729532,50.035713
2019-92818,2019-09-16,000001,Vente,280000,,,LE RIDOUX,B031,08170,08222,Haybes,08,,,08222000AN0034,,,,,,,,,,,,,0,,,,,VE,vergers,,,513,4.729776,50.035508
2019-92818,2019-09-16,000001,Vente,280000,,,LE RIDOUX,B031,08170,08222,Haybes,08,,,08222000AN0035,,,,,,,,,,,,,0,,,,,VE,vergers,,,513,4.729494,50.03552
2019-92818,2019-09-16,000001,Vente,280000,,,LE RIDOUX,B031,08170,08222,Haybes,08,,,08222000AN0081,,,,,,,,,,,,,0,,,,,VE,vergers,,,642,4.729412,50.035346
2019-92818,2019-09-16,000001,Vente,280000,,,LE RIDOUX,B031,08170,08222,Haybes,08,,,08222000AN0083,,,,,,,,,,,,,0,,,,,VE,vergers,,,604,4.729158,50.035573
2019-92823,2019-09-11,000001,Vente,43500,,,LE VILLAGE,B038,08170,08222,Haybes,08,,,08222000AC0177,,,,,,,,,,,,,0,,,,,J,jardins,,,75,4.70643,50.008471
2019-92823,2019-09-11,000001,Vente,43500,4,,RUE GUYNEMER,0070,08170,08222,Haybes,08,,,08222000AC0207,,,,,,,,,,,,,0,1,Maison,75,3,S,sols,,,76,4.705898,50.008109
2019-92908,2019-09-26,000001,Vente,120000,52,,RUE DE L ESPERANCE,0063,08170,08222,Haybes,08,,,08222000AD0318,,,,,,,,,,,,,0,1,Maison,100,5,S,sols,,,265,4.703253,50.003147
2019-92908,2019-09-26,000001,Vente,120000,,,CHAMP COTTAY HAUT,B009,08170,08222,Haybes,08,,,08222000AD0319,,,,,,,,,,,,,0,,,,,S,sols,,,189,4.703316,50.003202
2019-92908,2019-09-26,000001,Vente,120000,,,CHAMP COTTAY HAUT,B009,08170,08222,Haybes,08,,,08222000AD0330,,,,,,,,,,,,,0,,,,,J,jardins,,,249,4.703195,50.0033
2019-92948,2019-10-08,000001,Vente,69000,8,,RUE SAINT LOUIS,0180,08170,08222,Haybes,08,,,08222000AC0113,,,,,,,,,,,,,0,1,Maison,111,7,S,sols,,,146,4.704971,50.009498
2019-93106,2019-10-16,000001,Vente,41000,8,B,RUE VICTOR HUGO,0200,08170,08222,Haybes,08,,,08222000AE0319,,,,,,,,,,,,,0,1,Maison,44,2,S,sols,,,43,4.708477,50.009517
2019-93171,2019-11-02,000001,Vente,88000,48,,RUE MADAME DE CORMONT,0115,08170,08222,Haybes,08,,,08222000AK0061,,,,,,,,,,,,,0,1,Maison,78,5,P,prés,,,964,4.711301,50.002757
2019-93171,2019-11-02,000001,Vente,88000,48,,RUE MADAME DE CORMONT,0115,08170,08222,Haybes,08,,,08222000AK0061,,,,,,,,,,,,,0,1,Maison,78,5,S,sols,,,326,4.711301,50.002757
2019-93314,2019-11-09,000001,Vente,19000,,,LES ZIVAGES,B040,08170,08222,Haybes,08,,,08222000AK0459,,,,,,,,,,,,,0,,,,,AB,terrains a bâtir,,,1003,4.710342,50.002654
2019-93314,2019-11-09,000001,Vente,19000,,,LES ZIVAGES,B040,08170,08222,Haybes,08,,,08222000AK0460,,,,,,,,,,,,,0,,,,,AB,terrains a bâtir,,,44,4.710256,50.002482
2019-93320,2019-11-07,000001,Vente,56500,48,,RUE DE LA CENSE,0024,08170,08222,Haybes,08,,,08222000AC0330,,,,,,,,,,,,,0,1,Maison,70,4,S,sols,,,62,4.705538,50.007848
2019-93350,2019-11-29,000001,Vente,70000,5547,,CITE SAINT PIERRE,B014,08170,08222,Haybes,08,,,08222000AD0067,,,,,,,,,,,,,0,1,Maison,80,5,S,sols,,,121,4.703647,50.005297
2019-93363,2019-11-26,000001,Vente,90000,,,LE VILLAGE,B038,08170,08222,Haybes,08,,,08222000AE0392,,,,,,,,,,,,,0,,,,,S,sols,,,223,4.710343,50.010556
2019-93363,2019-11-26,000001,Vente,90000,13,,RUE DU DOCTEUR BONNET,0048,08170,08222,Haybes,08,,,08222000AE0393,,,,,,,,,,,,,0,1,Maison,90,5,S,sols,,,387,4.71039,50.010377
2019-93363,2019-11-26,000001,Vente,90000,5904,,RUE DU DOCTEUR BONNET,0048,08170,08222,Haybes,08,,,08222000AE0530,,,,,,,,,,,,,0,3,Dépendance,,0,S,sols,,,20,4.711872,50.010161
2019-93373,2019-11-12,000001,Vente,41000,,,LES BOIS,B002,08170,08222,Haybes,08,,,08222000AL0209,,,,,,,,,,,,,0,,,,,S,sols,,,32,4.70281,49.994952
2019-93373,2019-11-12,000001,Vente,41000,5818,,LES BOIS,B002,08170,08222,Haybes,08,,,08222000AL0211,,,,,,,,,,,,,0,1,Maison,101,3,S,sols,,,266,4.702711,49.994922
2019-93619,2019-12-12,000001,Vente,80000,5706,,LES BOIS,B002,08170,08222,Haybes,08,,,08222000AL0030,,,,,,,,,,,,,0,1,Maison,90,5,S,sols,,,422,4.699681,49.996833
2019-93619,2019-12-12,000001,Vente,80000,,,LES BOIS,B002,08170,08222,Haybes,08,,,08222000AL0031,,,,,,,,,,,,,0,,,,,VE,vergers,,,746,4.700059,49.996828
2019-93619,2019-12-12,000001,Vente,80000,,,LES BOIS,B002,08170,08222,Haybes,08,,,08222000AL0222,,,,,,,,,,,,,0,,,,,AB,terrains a bâtir,,,258,4.700453,49.996808
2019-93739,2019-12-20,000001,Vente,40000,5259,,LE VILLAGE,B038,08170,08222,Haybes,08,,,08222000AC0133,,,,,,,,,,,,,0,1,Maison,50,2,S,sols,,,259,4.706069,50.009529
2019-93739,2019-12-20,000001,Vente,40000,5259,,LE VILLAGE,B038,08170,08222,Haybes,08,,,08222000AC0133,,,,,,,,,,,,,0,4,Local industriel. commercial ou assimilé,30,0,S,sols,,,259,4.706069,50.009529
