id_mutation,date_mutation,numero_disposition,nature_mutation,valeur_fonciere,adresse_numero,adresse_suffixe,adresse_nom_voie,adresse_code_voie,code_postal,code_commune,nom_commune,code_departement,ancien_code_commune,ancien_nom_commune,id_parcelle,ancien_id_parcelle,numero_volume,lot1_numero,lot1_surface_carrez,lot2_numero,lot2_surface_carrez,lot3_numero,lot3_surface_carrez,lot4_numero,lot4_surface_carrez,lot5_numero,lot5_surface_carrez,nombre_lots,code_type_local,type_local,surface_reelle_bati,nombre_pieces_principales,code_nature_culture,nature_culture,code_nature_culture_speciale,nature_culture_speciale,surface_terrain,longitude,latitude
2019-95793,2019-01-03,000001,Vente,19000,5098,,RUE DES BUDES,0004,08310,08250,Leffincourt,08,,,08250000AS0263,,,,,,,,,,,,,0,3,Dépendance,,0,S,sols,,,234,4.54782,49.387952
2019-95811,2019-01-30,000001,Vente,80000,9,,RUE DE LA LIBERTE,0014,08310,08250,Leffincourt,08,,,08250000AS0282,,,,,,,,,,,,,0,1,Maison,152,4,S,sols,,,148,4.547596,49.387576
2019-95827,2019-01-24,000001,Vente,134159.77,,,FOND DU FONSEAU,B053,08310,08250,Leffincourt,08,,,08250000ZD0034,,,,,,,,,,,,,0,,,,,T,terres,,,11807,4.581209,49.391157
2019-95827,2019-01-24,000001,Vente,134159.77,,,FOND DU FONSEAU,B053,08310,08250,Leffincourt,08,,,08250000ZD0034,,,,,,,,,,,,,0,,,,,T,terres,,,23614,4.581209,49.391157
2019-95881,2019-02-26,000001,Vente,59000,4,,RUE DE LA MAIRIE,0015,08310,08250,Leffincourt,08,,,08250000AS0142,,,,,,,,,,,,,0,1,Maison,92,4,S,sols,,,830,4.546613,49.386138
2019-95923,2019-03-27,000001,Vente,43000,12,,RUE DE LA RETOURNE,0016,08310,08250,Leffincourt,08,,,08250000AS0028,,,,,,,,,,,,,0,1,Maison,90,3,S,sols,,,1163,4.544173,49.387942
2019-95975,2019-04-29,000001,Vente,32000,3,,RUE DE LA MAIRIE,0015,08310,08250,Leffincourt,08,,,08250000ZO0089,,,,,,,,,,,,,0,,,,,S,sols,,,1336,4.548183,49.384427
2019-96026,2019-05-13,000001,Vente,160000,3,,RUE DU ROUTY,0011,08310,08250,Leffincourt,08,,,08250000ZO0086,,,,,,,,,,,,,0,1,Maison,119,5,T,terres,,,3690,4.543513,49.386198
2019-96026,2019-05-13,000001,Vente,160000,3,,RUE DU ROUTY,0011,08310,08250,Leffincourt,08,,,08250000ZO0086,,,,,,,,,,,,,0,1,Maison,119,5,S,sols,,,918,4.543513,49.386198
2019-96053,2019-05-23,000001,Vente,45166,,,LA CORNETTE,B029,08310,08250,Leffincourt,08,,,08250000ZN0007,,,,,,,,,,,,,0,,,,,T,terres,,,10265,4.557968,49.376726
2019-96053,2019-05-23,000001,Vente,45166,,,LA CORNETTE,B029,08310,08250,Leffincourt,08,,,08250000ZN0007,,,,,,,,,,,,,0,,,,,T,terres,,,30795,4.557968,49.376726
2019-96128,2019-06-24,000001,Vente,66514,,,BLANCHES VOIES,B005,08310,08250,Leffincourt,08,,,08250000YE0025,,,,,,,,,,,,,0,,,,,T,terres,,,41010,4.53418,49.399239
2019-96128,2019-06-24,000001,Vente,66514,,,BLANCHES VOIES,B005,08310,08250,Leffincourt,08,,,08250000YE0025,,,,,,,,,,,,,0,,,,,T,terres,,,6500,4.53418,49.399239
2019-96138,2019-06-21,000004,Echange,50912.8,,,FOND DU FONSEAU,B053,08310,08250,Leffincourt,08,,,08250000ZD0034,,,,,,,,,,,,,0,,,,,T,terres,,,23614,4.581209,49.391157
2019-96138,2019-06-21,000004,Echange,50912.8,,,FOND DU FONSEAU,B053,08310,08250,Leffincourt,08,,,08250000ZD0034,,,,,,,,,,,,,0,,,,,T,terres,,,11807,4.581209,49.391157
2019-96141,2019-06-21,000007,Echange,62395.88,,,FOND DE BUSSY,B045,08310,08250,Leffincourt,08,,,08250000ZK0050,,,,,,,,,,,,,0,,,,,T,terres,,,9785,4.569736,49.364967
2019-96141,2019-06-21,000007,Echange,62395.88,,,ORLES DES CONGES,B088,08310,08250,Leffincourt,08,,,08250000ZM0016,,,,,,,,,,,,,0,,,,,T,terres,,,513,4.52687,49.372439
2019-96141,2019-06-21,000007,Echange,62395.88,,,ORLES DES CONGES,B088,08310,08250,Leffincourt,08,,,08250000ZM0018,,,,,,,,,,,,,0,,,,,T,terres,,,69,4.527,49.372518
2019-96141,2019-06-21,000007,Echange,62395.88,,,ORLES DES CONGES,B088,08310,08250,Leffincourt,08,,,08250000ZM0020,,,,,,,,,,,,,0,,,,,T,terres,,,1418,4.526367,49.371855
2019-96141,2019-06-21,000007,Echange,62395.88,,,FOSSE BOUQUIN,B054,08310,08250,Leffincourt,08,,,08250000ZO0003,,,,,,,,,,,,,0,,,,,T,terres,,,20160,4.535711,49.381268
2019-96141,2019-06-21,000007,Echange,62395.88,,,LE ROUTY,B102,08310,08250,Leffincourt,08,,,08250000ZO0020,,,,,,,,,,,,,0,,,,,T,terres,,,10660,4.547159,49.383874
2019-96141,2019-06-21,000007,Echange,62395.88,,,LE ROUTY,B102,08310,08250,Leffincourt,08,,,08250000ZO0021,,,,,,,,,,,,,0,,,,,T,terres,,,2900,4.547549,49.382855
2019-96154,2019-07-24,000001,Vente,74543,,,LA CORNETTE,B029,08310,08250,Leffincourt,08,,,08250000ZN0025,,,,,,,,,,,,,0,,,,,T,terres,,,48615,4.560316,49.374404
2019-96154,2019-07-24,000001,Vente,74543,,,LA CORNETTE,B029,08310,08250,Leffincourt,08,,,08250000ZN0025,,,,,,,,,,,,,0,,,,,T,terres,,,16205,4.560316,49.374404
2019-96379,2019-11-29,000001,Vente,100000,,,LE VILLAGE,B109,08310,08250,Leffincourt,08,,,08250000AS0111,,,,,,,,,,,,,0,,,,,L,landes,FRICH,Friche,822,4.549854,49.387723
2019-96379,2019-11-29,000001,Vente,100000,13,,RUE DE LA VALIERE,0018,08310,08250,Leffincourt,08,,,08250000AS0113,,,,,,,,,,,,,0,1,Maison,100,5,S,sols,,,1125,4.549388,49.387575
2019-96379,2019-11-29,000001,Vente,100000,,,LE VILLAGE,B109,08310,08250,Leffincourt,08,,,08250000AS0115,,,,,,,,,,,,,0,,,,,J,jardins,,,318,4.549105,49.388114
2019-96379,2019-11-29,000001,Vente,100000,,,MONTANT DE NAUCHARE,B075,08310,08250,Leffincourt,08,,,08250000ZV0032,,,,,,,,,,,,,0,,,,,P,prés,,,2400,4.549432,49.388072
2019-96389,2019-11-27,000001,Vente,175000,32,,RUE DE LA RETOURNE,0016,08310,08250,Leffincourt,08,,,08250000AS0019,,,,,,,,,,,,,0,1,Maison,134,5,S,sols,,,822,4.54233,49.387554
2019-96440,2019-12-19,000001,Vente,42170,,,FOND DE BUSSY,B045,08310,08250,Leffincourt,08,,,08250000ZK0050,,,,,,,,,,,,,0,,,,,T,terres,,,9785,4.569736,49.364967
2019-96440,2019-12-19,000001,Vente,42170,,,ORLES DES CONGES,B088,08310,08250,Leffincourt,08,,,08250000ZM0016,,,,,,,,,,,,,0,,,,,T,terres,,,513,4.52687,49.372439
2019-96440,2019-12-19,000001,Vente,42170,,,ORLES DES CONGES,B088,08310,08250,Leffincourt,08,,,08250000ZM0018,,,,,,,,,,,,,0,,,,,T,terres,,,69,4.527,49.372518
2019-96440,2019-12-19,000001,Vente,42170,,,ORLES DES CONGES,B088,08310,08250,Leffincourt,08,,,08250000ZM0020,,,,,,,,,,,,,0,,,,,T,terres,,,1418,4.526367,49.371855
2019-96440,2019-12-19,000001,Vente,42170,,,LE ROUTY,B102,08310,08250,Leffincourt,08,,,08250000ZO0020,,,,,,,,,,,,,0,,,,,T,terres,,,10660,4.547159,49.383874
2019-96440,2019-12-19,000001,Vente,42170,,,LE ROUTY,B102,08310,08250,Leffincourt,08,,,08250000ZO0021,,,,,,,,,,,,,0,,,,,T,terres,,,2900,4.547549,49.382855
2019-96447,2019-12-19,000001,Echange,32263,,,FOSSE BOUQUIN,B054,08310,08250,Leffincourt,08,,,08250000ZO0003,,,,,,,,,,,,,0,,,,,T,terres,,,20160,4.535711,49.381268
