id_mutation,date_mutation,numero_disposition,nature_mutation,valeur_fonciere,adresse_numero,adresse_suffixe,adresse_nom_voie,adresse_code_voie,code_postal,code_commune,nom_commune,code_departement,ancien_code_commune,ancien_nom_commune,id_parcelle,ancien_id_parcelle,numero_volume,lot1_numero,lot1_surface_carrez,lot2_numero,lot2_surface_carrez,lot3_numero,lot3_surface_carrez,lot4_numero,lot4_surface_carrez,lot5_numero,lot5_surface_carrez,nombre_lots,code_type_local,type_local,surface_reelle_bati,nombre_pieces_principales,code_nature_culture,nature_culture,code_nature_culture_speciale,nature_culture_speciale,surface_terrain,longitude,latitude
2019-95831,2019-01-29,000001,Vente,16859.5,,,SOUS LES DUES,B094,08400,08280,Marvaux-Vieux,08,,,08280000ZA0035,,,,,,,,,,,,,0,,,,,L,landes,FRICH,Friche,6350,4.664737,49.296528
2019-95956,2019-03-30,000001,Vente,95000,,,VILLAGE DE MARVAUX SUD,B102,08400,08280,Marvaux-Vieux,08,,,082800000B0270,,,,,,,,,,,,,0,,,,,J,jardins,,,381,4.680832,49.289003
2019-95956,2019-03-30,000001,Vente,95000,,,VILLAGE DE MARVAUX SUD,B102,08400,08280,Marvaux-Vieux,08,,,082800000B0271,,,,,,,,,,,,,0,,,,,J,jardins,,,224,4.680837,49.28914
2019-95956,2019-03-30,000001,Vente,95000,2,,RLE DES VOIRIES,0055,08400,08280,Marvaux-Vieux,08,,,082800000B0272,,,,,,,,,,,,,0,1,Maison,104,5,S,sols,,,865,4.680909,49.289203
2019-95956,2019-03-30,000001,Vente,95000,,,VILLAGE DE MARVAUX SUD,B102,08400,08280,Marvaux-Vieux,08,,,082800000B0273,,,,,,,,,,,,,0,,,,,S,sols,,,72,4.68085,49.289432
2019-95956,2019-03-30,000001,Vente,95000,5014,,VILLAGE DE MARVAUX SUD,B102,08400,08280,Marvaux-Vieux,08,,,082800000B0278,,,,,,,,,,,,,0,1,Maison,68,2,S,sols,,,712,4.681212,49.289355
2019-95956,2019-03-30,000001,Vente,95000,,,VILLAGE DE MARVAUX SUD,B102,08400,08280,Marvaux-Vieux,08,,,082800000B0279,,,,,,,,,,,,,0,,,,,J,jardins,,,280,4.681376,49.289373
2019-95956,2019-03-30,000001,Vente,95000,,,VILLAGE DE MARVAUX SUD,B102,08400,08280,Marvaux-Vieux,08,,,082800000B0301,,,,,,,,,,,,,0,,,,,S,sols,,,80,4.680847,49.289482
2019-95956,2019-03-30,000001,Vente,95000,,,VILLAGE DE MARVAUX SUD,B102,08400,08280,Marvaux-Vieux,08,,,082800000B0302,,,,,,,,,,,,,0,,,,,S,sols,,,103,4.680702,49.289392
2019-95956,2019-03-30,000001,Vente,95000,,,VILLAGE DE MARVAUX SUD,B102,08400,08280,Marvaux-Vieux,08,,,082800000B0331,,,,,,,,,,,,,0,,,,,S,sols,,,40,4.68058,49.289372
2019-95956,2019-03-30,000001,Vente,95000,,,VILLAGE DE MARVAUX,B114,08400,08280,Marvaux-Vieux,08,,,08280000ZI0022,,,,,,,,,,,,,0,,,,,P,prés,,,3026,4.681179,49.28866
2019-95956,2019-03-30,000001,Vente,95000,,,VILLAGE DE MARVAUX,B114,08400,08280,Marvaux-Vieux,08,,,08280000ZI0023,,,,,,,,,,,,,0,,,,,P,prés,,,2754,4.681523,49.288951
2019-96437,2019-12-10,000001,Vente,59000,,,VILLAGE DE MARVAUX NORD,B101,08400,08280,Marvaux-Vieux,08,,,082800000B0151,,,,,,,,,,,,,0,,,,,P,prés,,,95,4.678734,49.2901
2019-96437,2019-12-10,000001,Vente,59000,,,VILLAGE DE MARVAUX NORD,B101,08400,08280,Marvaux-Vieux,08,,,082800000B0152,,,,,,,,,,,,,0,,,,,P,prés,,,664,4.678722,49.289981
2019-96437,2019-12-10,000001,Vente,59000,20,,RUE PRINCIPALE,0040,08400,08280,Marvaux-Vieux,08,,,082800000B0153,,,,,,,,,,,,,0,1,Maison,111,5,S,sols,,,332,4.678952,49.289731
2019-96437,2019-12-10,000001,Vente,59000,,,VILLAGE DE MARVAUX NORD,B101,08400,08280,Marvaux-Vieux,08,,,082800000B0154,,,,,,,,,,,,,0,,,,,J,jardins,,,662,4.678946,49.289973
