id_mutation,date_mutation,numero_disposition,nature_mutation,valeur_fonciere,adresse_numero,adresse_suffixe,adresse_nom_voie,adresse_code_voie,code_postal,code_commune,nom_commune,code_departement,ancien_code_commune,ancien_nom_commune,id_parcelle,ancien_id_parcelle,numero_volume,lot1_numero,lot1_surface_carrez,lot2_numero,lot2_surface_carrez,lot3_numero,lot3_surface_carrez,lot4_numero,lot4_surface_carrez,lot5_numero,lot5_surface_carrez,nombre_lots,code_type_local,type_local,surface_reelle_bati,nombre_pieces_principales,code_nature_culture,nature_culture,code_nature_culture_speciale,nature_culture_speciale,surface_terrain,longitude,latitude
2019-94112,2019-05-10,000001,Vente,25000,,,LE BOURG,B004,08190,08340,Poilcourt-Sydney,08,,,08340000AB0263,,,,,,,,,,,,,0,,,,,S,sols,,,265,4.100851,49.421013
2019-94112,2019-05-10,000001,Vente,25000,5055,,LE BOURG,B004,08190,08340,Poilcourt-Sydney,08,,,08340000AB0264,,,,,,,,,,,,,0,3,Dépendance,,0,S,sols,,,25,4.100981,49.42082
2019-94112,2019-05-10,000001,Vente,25000,5055,,LE BOURG,B004,08190,08340,Poilcourt-Sydney,08,,,08340000AB0264,,,,,,,,,,,,,0,3,Dépendance,,0,J,jardins,,,554,4.100981,49.42082
2019-94112,2019-05-10,000001,Vente,25000,,,LE BOURG,B004,08190,08340,Poilcourt-Sydney,08,,,08340000AB0272,,,,,,,,,,,,,0,,,,,S,sols,,,124,4.100386,49.421117
2019-94152,2019-05-28,000001,Vente,9500,,,DERRIERE LES HAIES,B009,08190,08340,Poilcourt-Sydney,08,,,08340000ZC0060,,,,,,,,,,,,,0,,,,,T,terres,,,9558,4.102353,49.425932
2019-94224,2019-06-28,000001,Vente,3693,,,LA PRINCE,B022,08190,08340,Poilcourt-Sydney,08,,,08340000AC0136,,,,,,,,,,,,,0,,,,,BP,peupleraies,,,2452,4.099611,49.41985
2019-94224,2019-06-28,000001,Vente,3693,,,LA POINTE,B020,08190,08340,Poilcourt-Sydney,08,,,08340000ZA0028,,,,,,,,,,,,,0,,,,,L,landes,FRICH,Friche,2760,4.080335,49.422777
2019-94340,2019-08-05,000001,Vente,162100,5026,,LE BOURG,B004,08190,08340,Poilcourt-Sydney,08,,,08340000AB0033,,,,,,,,,,,,,0,1,Maison,104,4,S,sols,,,657,4.102184,49.422691
2019-94341,2019-08-06,000001,Vente,184700,33,,RTE DE VOUZIERS,0032,08190,08340,Poilcourt-Sydney,08,,,08340000ZC0061,,,,,,,,,,,,,0,1,Maison,111,4,S,sols,,,696,4.106291,49.423794
2019-94343,2019-08-02,000001,Vente,8000,,,LE TRONC SAINT PIERRE,B025,08190,08340,Poilcourt-Sydney,08,,,08340000YA0008,,,,,,,,,,,,,0,,,,,T,terres,,,41820,4.09693,49.404081
2019-94343,2019-08-02,000001,Vente,8000,,,ABOUTISSANT AU CHEM DE BRI,B001,08190,08340,Poilcourt-Sydney,08,,,08340000ZA0008,,,,,,,,,,,,,0,,,,,T,terres,,,27270,4.094406,49.425194
2019-94343,2019-08-02,000001,Vente,8000,,,ABOUTISSANT AU CHEM DE BRI,B001,08190,08340,Poilcourt-Sydney,08,,,08340000ZA0009,,,,,,,,,,,,,0,,,,,T,terres,,,29050,4.094966,49.424672
2019-94343,2019-08-02,000001,Vente,8000,,,ABOUTISSANT AU CHEM DE BRI,B001,08190,08340,Poilcourt-Sydney,08,,,08340000ZA0011,,,,,,,,,,,,,0,,,,,T,terres,,,4600,4.09578,49.423955
2019-94343,2019-08-02,000001,Vente,8000,,,ABOUTISSANT AU CHEM DE BRI,B001,08190,08340,Poilcourt-Sydney,08,,,08340000ZA0017,,,,,,,,,,,,,0,,,,,T,terres,,,46253,4.095952,49.424435
2019-94343,2019-08-02,000001,Vente,8000,,,LES CRAYES,B007,08190,08340,Poilcourt-Sydney,08,,,08340000ZB0005,,,,,,,,,,,,,0,,,,,T,terres,,,30830,4.093766,49.429925
2019-94343,2019-08-02,000001,Vente,8000,,,LES CRAYES,B007,08190,08340,Poilcourt-Sydney,08,,,08340000ZB0006,,,,,,,,,,,,,0,,,,,T,terres,,,67690,4.09508,49.429466
2019-94343,2019-08-02,000001,Vente,8000,,,AU DESSUS DE L EGLISE,B010,08190,08340,Poilcourt-Sydney,08,,,08340000ZC0013,,,,,,,,,,,,,0,,,,,T,terres,,,57780,4.103621,49.430191
2019-94343,2019-08-02,000001,Vente,8000,,,LA FOSSE DILLON,B012,08190,08340,Poilcourt-Sydney,08,,,08340000ZD0015,,,,,,,,,,,,,0,,,,,T,terres,,,28140,4.100495,49.413477
2019-94343,2019-08-02,000001,Vente,8000,,,LA MINGUETTE,B017,08190,08340,Poilcourt-Sydney,08,,,08340000ZE0005,,,,,,,,,,,,,0,,,,,T,terres,,,84870,4.084304,49.407595
2019-94383,2019-08-27,000001,Vente,238000,,,LE BOURG,B004,08190,08340,Poilcourt-Sydney,08,,,08340000AB0337,,,,,,,,,,,,,0,,,,,P,prés,,,548,4.10709,49.42256
2019-94487,2019-10-23,000001,Vente,123340,,,LE BOURG,B004,08190,08340,Poilcourt-Sydney,08,,,08340000AB0082,,,,,,,,,,,,,0,,,,,BT,taillis simples,,,1762,4.106159,49.422112
2019-94497,2019-10-25,000001,Vente,180760,5022,A,LE BOURG,B004,08190,08340,Poilcourt-Sydney,08,,,08340000AB0211,,,,,,,,,,,,,0,3,Dépendance,,0,J,jardins,,,3206,4.101946,49.423287
2019-94497,2019-10-25,000001,Vente,180760,5022,A,LE BOURG,B004,08190,08340,Poilcourt-Sydney,08,,,08340000AB0211,,,,,,,,,,,,,0,1,Maison,96,4,J,jardins,,,3206,4.101946,49.423287
2019-94497,2019-10-25,000001,Vente,180760,5022,A,LE BOURG,B004,08190,08340,Poilcourt-Sydney,08,,,08340000AB0211,,,,,,,,,,,,,0,1,Maison,96,4,S,sols,,,825,4.101946,49.423287
2019-94497,2019-10-25,000001,Vente,180760,5022,A,LE BOURG,B004,08190,08340,Poilcourt-Sydney,08,,,08340000AB0211,,,,,,,,,,,,,0,3,Dépendance,,0,S,sols,,,825,4.101946,49.423287
2019-94497,2019-10-25,000001,Vente,180760,,,LES MUTILLES,B018,08190,08340,Poilcourt-Sydney,08,,,08340000AC0107,,,,,,,,,,,,,0,,,,,BT,taillis simples,,,521,4.086707,49.41856
2019-94497,2019-10-25,000001,Vente,180760,,,LES GRANDS MARAIS,B014,08190,08340,Poilcourt-Sydney,08,,,08340000AC0199,,,,,,,,,,,,,0,,,,,BP,peupleraies,,,3316,4.089331,49.422631
2019-94602,2019-12-06,000001,Vente,217000,37,,RTE DE VOUZIERS,0032,08190,08340,Poilcourt-Sydney,08,,,08340000ZC0084,,,,,,,,,,,,,0,1,Maison,120,4,S,sols,,,931,4.106657,49.423757
2019-94615,2019-12-11,000001,Vente,1500,,,LA PRINCE,B022,08190,08340,Poilcourt-Sydney,08,,,08340000AC0072,,,,,,,,,,,,,0,,,,,BT,taillis simples,,,1234,4.09933,49.419943
2019-94615,2019-12-11,000001,Vente,1500,,,LA PRINCE,B022,08190,08340,Poilcourt-Sydney,08,,,08340000AC0073,,,,,,,,,,,,,0,,,,,BT,taillis simples,,,2520,4.099136,49.419936
