id_mutation,date_mutation,numero_disposition,nature_mutation,valeur_fonciere,adresse_numero,adresse_suffixe,adresse_nom_voie,adresse_code_voie,code_postal,code_commune,nom_commune,code_departement,ancien_code_commune,ancien_nom_commune,id_parcelle,ancien_id_parcelle,numero_volume,lot1_numero,lot1_surface_carrez,lot2_numero,lot2_surface_carrez,lot3_numero,lot3_surface_carrez,lot4_numero,lot4_surface_carrez,lot5_numero,lot5_surface_carrez,nombre_lots,code_type_local,type_local,surface_reelle_bati,nombre_pieces_principales,code_nature_culture,nature_culture,code_nature_culture_speciale,nature_culture_speciale,surface_terrain,longitude,latitude
2019-96734,2019-01-17,000001,Vente,222000,42,,GAILLAC,B010,09100,09056,Bézac,09,,,090560000C0014,,,,,,,,,,,,,0,1,Maison,50,3,S,sols,,,1599,1.588806,43.151942
2019-96734,2019-01-17,000001,Vente,222000,42,,GAILLAC,B010,09100,09056,Bézac,09,,,090560000C0014,,,,,,,,,,,,,0,1,Maison,165,5,S,sols,,,1599,1.588806,43.151942
2019-96734,2019-01-17,000001,Vente,222000,,,GAILLAC,B010,09100,09056,Bézac,09,,,090560000C0015,,,,,,,,,,,,,0,,,,,T,terres,,,14198,1.589893,43.151253
2019-96734,2019-01-17,000001,Vente,222000,,,GAILLAC,B010,09100,09056,Bézac,09,,,090560000C0016,,,,,,,,,,,,,0,,,,,BT,taillis simples,,,6453,1.590237,43.151639
2019-96734,2019-01-17,000001,Vente,222000,,,GAILLAC,B010,09100,09056,Bézac,09,,,090560000C0017,,,,,,,,,,,,,0,,,,,L,landes,,,17946,1.590786,43.151444
2019-96734,2019-01-17,000001,Vente,222000,,,GAILLAC,B010,09100,09056,Bézac,09,,,090560000C0018,,,,,,,,,,,,,0,,,,,T,terres,,,9754,1.591972,43.151393
2019-96734,2019-01-17,000001,Vente,222000,,,GAILLAC,B010,09100,09056,Bézac,09,,,090560000C0101,,,,,,,,,,,,,0,,,,,T,terres,,,1156,1.589477,43.152483
2019-96734,2019-01-17,000001,Vente,222000,,,GAILLAC,B010,09100,09056,Bézac,09,,,090560000C0102,,,,,,,,,,,,,0,,,,,P,prés,,,2528,1.589156,43.151925
2019-96734,2019-01-17,000001,Vente,222000,,,GAILLAC,B010,09100,09056,Bézac,09,,,090560000C0102,,,,,,,,,,,,,0,,,,,S,sols,,,2528,1.589156,43.151925
2019-96734,2019-01-17,000001,Vente,222000,,,GAILLAC,B010,09100,09056,Bézac,09,,,090560000C0103,,,,,,,,,,,,,0,,,,,L,landes,,,646,1.59145,43.152109
2019-97303,2019-03-19,000001,Vente,34000,,,RIAT,B028,09100,09056,Bézac,09,,,090560000A1500,,,,,,,,,,,,,0,,,,,S,sols,,,248,1.572094,43.146408
2019-97303,2019-03-19,000001,Vente,34000,,,RIAT,B028,09100,09056,Bézac,09,,,090560000A1503,,,,,,,,,,,,,0,,,,,T,terres,,,178,1.572372,43.146452
2019-97303,2019-03-19,000001,Vente,34000,,,RIAT,B028,09100,09056,Bézac,09,,,090560000A1504,,,,,,,,,,,,,0,,,,,T,terres,,,771,1.572165,43.146277
2019-97824,2019-04-25,000001,Vente,63000,,,LAS FAILLADOS,B017,09100,09056,Bézac,09,,,090560000D0072,,,,,,,,,,,,,0,,,,,P,prés,,,4284,1.571448,43.146596
2019-98796,2019-07-10,000001,Vente,37000,,,RIAT,B028,09100,09056,Bézac,09,,,090560000A1125,,,,,,,,,,,,,0,,,,,T,terres,,,903,1.5721,43.145936
2019-98954,2019-07-05,000001,Vente,53000,4,,GERBET HAMEAU,B012,09100,09056,Bézac,09,,,090560000A1129,,,,,,,,,,,,,0,1,Maison,70,3,S,sols,,,568,1.572604,43.146398
2019-98954,2019-07-05,000001,Vente,53000,,,GERBET HAMEAU,B012,09100,09056,Bézac,09,,,090560000A1130,,,,,,,,,,,,,0,,,,,S,sols,,,14,1.572707,43.14653
2019-99095,2019-07-19,000001,Vente,170000,,,FIQUET,B008,09100,09056,Bézac,09,,,090560000A1624,,,,,,,,,,,,,0,,,,,AB,terrains a bâtir,,,512,1.576024,43.151049
2019-99095,2019-07-19,000001,Vente,170000,,,FIQUET,B008,09100,09056,Bézac,09,,,090560000A1626,,,,,,,,,,,,,0,,,,,AB,terrains a bâtir,,,98,1.575848,43.151106
2019-99117,2019-08-05,000001,Vente,150,,,RAMONDE,B027,09100,09056,Bézac,09,,,09056000ZA0009,,,,,,,,,,,,,0,,,,,AB,terrains a bâtir,CHEM,Chemin (non groupe),1262,1.59326,43.152661
2019-99339,2019-08-21,000001,Vente,50,,,LANCE,B014,09100,09056,Bézac,09,,,090560000D0065,,,,,,,,,,,,,0,,,,,J,jardins,,,393,1.571529,43.146892
2019-99339,2019-08-21,000001,Vente,50,,,LAS FAILLADOS,B017,09100,09056,Bézac,09,,,090560000D0152,,,,,,,,,,,,,0,,,,,J,jardins,,,147,1.571751,43.146988
2019-99495,2019-09-12,000001,Vente,173000,,,FIQUET,B008,09100,09056,Bézac,09,,,090560000A1625,,,,,,,,,,,,,0,,,,,AB,terrains a bâtir,,,469,1.57616,43.151197
2019-99495,2019-09-12,000001,Vente,173000,,,FIQUET,B008,09100,09056,Bézac,09,,,090560000A1626,,,,,,,,,,,,,0,,,,,AB,terrains a bâtir,,,98,1.575848,43.151106
2019-99495,2019-09-12,000001,Vente,173000,,,FIQUET,B008,09100,09056,Bézac,09,,,090560000A1629,,,,,,,,,,,,,0,,,,,AB,terrains a bâtir,,,600,1.576525,43.151393
2019-99967,2019-10-01,000001,Vente,100000,,,FIQUET,B008,09100,09056,Bézac,09,,,090560000A1589,,,,,,,,,,,,,0,,,,,T,terres,,,2792,1.569014,43.153411
2019-100456,2019-11-13,000001,Vente,50000,,,FIQUET,B008,09100,09056,Bézac,09,,,090560000A1525,,,,,,,,,,,,,0,,,,,AB,terrains a bâtir,,,1104,1.57585,43.151225
2019-100456,2019-11-13,000001,Vente,50000,,,FIQUET,B008,09100,09056,Bézac,09,,,090560000A1545,,,,,,,,,,,,,0,,,,,AB,terrains a bâtir,,,703,1.576426,43.151572
2019-100817,2019-11-29,000001,Vente,280700,680,,RTE DE CONSTANTINE,0090,09100,09056,Bézac,09,,,090560000A1510,,,,,,,,,,,,,0,1,Maison,130,4,AG,terrains d'agrément,,,905,1.568432,43.152725
2019-100817,2019-11-29,000001,Vente,280700,680,,RTE DE CONSTANTINE,0090,09100,09056,Bézac,09,,,090560000A1510,,,,,,,,,,,,,0,1,Maison,130,4,S,sols,,,1000,1.568432,43.152725
2019-100817,2019-11-29,000001,Vente,280700,,,RIAT,B028,09100,09056,Bézac,09,,,090560000A1511,,,,,,,,,,,,,0,,,,,T,terres,,,53,1.568631,43.152928
