id_mutation,date_mutation,numero_disposition,nature_mutation,valeur_fonciere,adresse_numero,adresse_suffixe,adresse_nom_voie,adresse_code_voie,code_postal,code_commune,nom_commune,code_departement,ancien_code_commune,ancien_nom_commune,id_parcelle,ancien_id_parcelle,numero_volume,lot1_numero,lot1_surface_carrez,lot2_numero,lot2_surface_carrez,lot3_numero,lot3_surface_carrez,lot4_numero,lot4_surface_carrez,lot5_numero,lot5_surface_carrez,nombre_lots,code_type_local,type_local,surface_reelle_bati,nombre_pieces_principales,code_nature_culture,nature_culture,code_nature_culture_speciale,nature_culture_speciale,surface_terrain,longitude,latitude
2019-98711,2019-07-05,000001,Vente,149500,,,ESCOUMES,B020,09250,09330,Vernaux,09,,,093300000C0026,,,,,,,,,,,,,0,,,,,L,landes,,,110,1.755917,42.772658
2019-98711,2019-07-05,000001,Vente,149500,35,,ESCOUMES,B020,09250,09330,Vernaux,09,,,093300000C0027,,,,,,,,,,,,,0,1,Maison,104,5,S,sols,,,855,1.756029,42.772746
2019-99404,2019-08-02,000001,Vente,82500,,,VILLAGE DE VERNAUX,B047,09250,09330,Vernaux,09,,,093300000C0095,,,,,,,,,,,,,0,,,,,S,sols,,,35,1.758224,42.771987
2019-99404,2019-08-02,000001,Vente,82500,19,,VILLAGE DE VERNAUX,B047,09250,09330,Vernaux,09,,,093300000C0784,,1,,,,,,,,,,,0,,,,,,,,,,1.75798,42.772054
2019-99404,2019-08-02,000001,Vente,82500,,,VILLAGE DE VERNAUX,B047,09250,09330,Vernaux,09,,,093300000C0785,,,,,,,,,,,,,0,,,,,S,sols,,,217,1.758077,42.772
2019-99404,2019-08-02,000001,Vente,82500,,,VILLAGE DE VERNAUX,B047,09250,09330,Vernaux,09,,,093300000C0786,,,,,,,,,,,,,0,,,,,S,sols,,,12,1.758263,42.771975
2019-99739,2019-09-30,000001,Vente,25000,,,VILLAGE DE VERNAUX,B047,09250,09330,Vernaux,09,,,093300000C0735,,,,,,,,,,,,,0,,,,,T,terres,,,734,,
2019-100048,2019-10-22,000001,Vente,3000,39,,VILLAGE DE VERNAUX,B047,09250,09330,Vernaux,09,,,093300000C0082,,,,,,,,,,,,,0,3,Dépendance,,0,S,sols,,,40,1.757488,42.772547
2019-101009,2019-12-20,000001,Vente,9618,,,ESCOUMES,B020,09250,09330,Vernaux,09,,,093300000C0032,,,,,,,,,,,,,0,,,,,T,terres,,,341,1.756579,42.773539
2019-101010,2019-12-20,000002,Vente,23382,,,ESCOUMES,B020,09250,09330,Vernaux,09,,,093300000C0031,,,,,,,,,,,,,0,,,,,T,terres,,,829,1.756548,42.773336
