id_mutation,date_mutation,numero_disposition,nature_mutation,valeur_fonciere,adresse_numero,adresse_suffixe,adresse_nom_voie,adresse_code_voie,code_postal,code_commune,nom_commune,code_departement,ancien_code_commune,ancien_nom_commune,id_parcelle,ancien_id_parcelle,numero_volume,lot1_numero,lot1_surface_carrez,lot2_numero,lot2_surface_carrez,lot3_numero,lot3_surface_carrez,lot4_numero,lot4_surface_carrez,lot5_numero,lot5_surface_carrez,nombre_lots,code_type_local,type_local,surface_reelle_bati,nombre_pieces_principales,code_nature_culture,nature_culture,code_nature_culture_speciale,nature_culture_speciale,surface_terrain,longitude,latitude
2019-98982,2019-07-19,000001,Vente,24000,,,LE FERRATCHAT,B009,09120,09340,Vira,09,,,09340000ZA0061,,,,,,,,,,,,,0,,,,,AB,terrains a bâtir,,,501,1.757221,43.051218
2019-99614,2019-09-13,000002,Vente,27000,28,,RUE ALPHONSE RESCANIERES,0010,09120,09340,Vira,09,,,093400000B1208,,,,,,,,,,,,,0,,,,,S,sols,,,306,1.757479,43.051621
2019-99614,2019-09-13,000002,Vente,27000,,,LA PLANO,B016,09120,09340,Vira,09,,,09340000ZB0129,,,,,,,,,,,,,0,,,,,T,terres,,,321,1.757565,43.051652
2019-99699,2019-09-20,000001,Vente,136792,49,,LE COUMEL,B006,09120,09340,Vira,09,,,09340000ZC0032,,,,,,,,,,,,,0,1,Maison,24,1,L,landes,,,8705,1.762104,43.051914
2019-99699,2019-09-20,000001,Vente,136792,49,,LE COUMEL,B006,09120,09340,Vira,09,,,09340000ZC0032,,,,,,,,,,,,,0,1,Maison,110,3,P,prés,,,2150,1.762104,43.051914
2019-99699,2019-09-20,000001,Vente,136792,49,,LE COUMEL,B006,09120,09340,Vira,09,,,09340000ZC0032,,,,,,,,,,,,,0,1,Maison,24,1,P,prés,,,2150,1.762104,43.051914
2019-99699,2019-09-20,000001,Vente,136792,49,,LE COUMEL,B006,09120,09340,Vira,09,,,09340000ZC0032,,,,,,,,,,,,,0,1,Maison,110,3,P,prés,,,1600,1.762104,43.051914
2019-99699,2019-09-20,000001,Vente,136792,49,,LE COUMEL,B006,09120,09340,Vira,09,,,09340000ZC0032,,,,,,,,,,,,,0,1,Maison,24,1,P,prés,,,1600,1.762104,43.051914
2019-99699,2019-09-20,000001,Vente,136792,49,,LE COUMEL,B006,09120,09340,Vira,09,,,09340000ZC0032,,,,,,,,,,,,,0,1,Maison,24,1,P,prés,,,4095,1.762104,43.051914
2019-99699,2019-09-20,000001,Vente,136792,49,,LE COUMEL,B006,09120,09340,Vira,09,,,09340000ZC0032,,,,,,,,,,,,,0,1,Maison,110,3,P,prés,,,4095,1.762104,43.051914
2019-99699,2019-09-20,000001,Vente,136792,49,,LE COUMEL,B006,09120,09340,Vira,09,,,09340000ZC0032,,,,,,,,,,,,,0,1,Maison,110,3,S,sols,,,840,1.762104,43.051914
2019-99699,2019-09-20,000001,Vente,136792,49,,LE COUMEL,B006,09120,09340,Vira,09,,,09340000ZC0032,,,,,,,,,,,,,0,1,Maison,110,3,L,landes,,,8705,1.762104,43.051914
2019-99699,2019-09-20,000001,Vente,136792,49,,LE COUMEL,B006,09120,09340,Vira,09,,,09340000ZC0032,,,,,,,,,,,,,0,1,Maison,24,1,S,sols,,,840,1.762104,43.051914
2019-99699,2019-09-20,000001,Vente,136792,,,LE COUMEL,B006,09120,09340,Vira,09,,,09340000ZC0098,,,,,,,,,,,,,0,,,,,BS,taillis sous futaie,,,677,1.761342,43.051805
2019-99699,2019-09-20,000001,Vente,136792,,,LE COUMEL,B006,09120,09340,Vira,09,,,09340000ZC0098,,,,,,,,,,,,,0,,,,,P,prés,,,1323,1.761342,43.051805
2019-99699,2019-09-20,000001,Vente,136792,,,LE COUMEL,B006,09120,09340,Vira,09,,,09340000ZC0099,,,,,,,,,,,,,0,,,,,BS,taillis sous futaie,,,1748,1.761527,43.052919
2019-99699,2019-09-20,000001,Vente,136792,,,LE COUMEL,B006,09120,09340,Vira,09,,,09340000ZC0099,,,,,,,,,,,,,0,,,,,P,prés,,,1102,1.761527,43.052919
2019-99699,2019-09-20,000001,Vente,136792,,,LE COUMEL,B006,09120,09340,Vira,09,,,09340000ZC0099,,,,,,,,,,,,,0,,,,,L,landes,,,1310,1.761527,43.052919
2019-99885,2019-09-28,000001,Vente,146750,81,,LA PLANO,B016,09120,09340,Vira,09,,,09340000ZB0116,,,,,,,,,,,,,0,1,Maison,90,4,S,sols,,,926,1.757057,43.051805
2019-100305,2019-10-17,000001,Vente,105000,3,,LA PLANO,B016,09120,09340,Vira,09,,,09340000ZB0117,,,,,,,,,,,,,0,1,Maison,78,3,T,terres,,,1758,1.756089,43.05242
2019-100305,2019-10-17,000001,Vente,105000,3,,LA PLANO,B016,09120,09340,Vira,09,,,09340000ZB0117,,,,,,,,,,,,,0,1,Maison,78,3,S,sols,,,589,1.756089,43.05242
