id_mutation,date_mutation,numero_disposition,nature_mutation,valeur_fonciere,adresse_numero,adresse_suffixe,adresse_nom_voie,adresse_code_voie,code_postal,code_commune,nom_commune,code_departement,ancien_code_commune,ancien_nom_commune,id_parcelle,ancien_id_parcelle,numero_volume,lot1_numero,lot1_surface_carrez,lot2_numero,lot2_surface_carrez,lot3_numero,lot3_surface_carrez,lot4_numero,lot4_surface_carrez,lot5_numero,lot5_surface_carrez,nombre_lots,code_type_local,type_local,surface_reelle_bati,nombre_pieces_principales,code_nature_culture,nature_culture,code_nature_culture_speciale,nature_culture_speciale,surface_terrain,longitude,latitude
2019-110311,2019-04-25,000001,Vente,325000,,,LES MOUNELS,B056,11300,11364,Saint-Polycarpe,11,,,113640000A0499,,,,,,,,,,,,,0,1,Maison,145,4,S,sols,,,1000,2.282164,43.037391
2019-110311,2019-04-25,000001,Vente,325000,,,LES MOUNELS,B056,11300,11364,Saint-Polycarpe,11,,,113640000A0499,,,,,,,,,,,,,0,3,Dépendance,,0,L,landes,,,15420,2.282164,43.037391
2019-110311,2019-04-25,000001,Vente,325000,,,LES MOUNELS,B056,11300,11364,Saint-Polycarpe,11,,,113640000A0499,,,,,,,,,,,,,0,1,Maison,145,4,L,landes,,,15420,2.282164,43.037391
2019-110311,2019-04-25,000001,Vente,325000,,,LES MOUNELS,B056,11300,11364,Saint-Polycarpe,11,,,113640000A0499,,,,,,,,,,,,,0,3,Dépendance,,0,S,sols,,,1000,2.282164,43.037391
2019-110622,2019-05-20,000002,Vente,60000,,,LES CONDOMINES,B021,11300,11364,Saint-Polycarpe,11,,,113640000B0881,,,,,,,,,,,,,0,,,,,T,terres,,,1552,2.287198,43.040826
2019-110622,2019-05-20,000002,Vente,60000,,,LES CONDOMINES,B021,11300,11364,Saint-Polycarpe,11,,,113640000B0882,,,,,,,,,,,,,0,,,,,T,terres,,,113,2.287009,43.040837
2019-110622,2019-05-20,000002,Vente,60000,,,LES CONDOMINES,B021,11300,11364,Saint-Polycarpe,11,,,113640000B0883,,,,,,,,,,,,,0,,,,,T,terres,,,1636,2.287454,43.040345
2019-110622,2019-05-20,000002,Vente,60000,,,LES CONDOMINES,B021,11300,11364,Saint-Polycarpe,11,,,113640000B0884,,,,,,,,,,,,,0,,,,,T,terres,,,104,2.287176,43.040382
2019-111825,2019-07-08,000001,Vente,10059,,,LA BARRERO,B010,11300,11364,Saint-Polycarpe,11,,,113640000B0302,,,,,,,,,,,,,0,,,,,L,landes,,,668,2.29822,43.037741
2019-111825,2019-07-08,000001,Vente,10059,,,LA BARRERO,B010,11300,11364,Saint-Polycarpe,11,,,113640000B0302,,,,,,,,,,,,,0,,,,,T,terres,,,1432,2.29822,43.037741
2019-111825,2019-07-08,000001,Vente,10059,,,LA BARRERO,B010,11300,11364,Saint-Polycarpe,11,,,113640000B0303,,,,,,,,,,,,,0,,,,,T,terres,,,1700,2.299144,43.03728
2019-111825,2019-07-08,000001,Vente,10059,,,LA BARRERO,B010,11300,11364,Saint-Polycarpe,11,,,113640000B0304,,,,,,,,,,,,,0,,,,,T,terres,,,3260,2.300372,43.036943
2019-111825,2019-07-08,000001,Vente,10059,,,LA BARRERO,B010,11300,11364,Saint-Polycarpe,11,,,113640000B0305,,,,,,,,,,,,,0,,,,,T,terres,,,1950,2.29941,43.03698
2019-111825,2019-07-08,000001,Vente,10059,,,LA BARRERO,B010,11300,11364,Saint-Polycarpe,11,,,113640000B0306,,,,,,,,,,,,,0,,,,,T,terres,,,3050,2.300295,43.036783
2019-111825,2019-07-08,000001,Vente,10059,,,LA BARRERO,B010,11300,11364,Saint-Polycarpe,11,,,113640000B0307,,,,,,,,,,,,,0,,,,,T,terres,,,1180,2.301064,43.036608
2019-111825,2019-07-08,000001,Vente,10059,,,LAS PAUSOS,B048,11300,11364,Saint-Polycarpe,11,,,113640000B0663,,,,,,,,,,,,,0,,,,,T,terres,,,3050,2.304828,43.036213
2019-111825,2019-07-08,000001,Vente,10059,,,LAS PAUSOS,B048,11300,11364,Saint-Polycarpe,11,,,113640000B0664,,,,,,,,,,,,,0,,,,,T,terres,,,1230,2.304084,43.036367
2019-111825,2019-07-08,000001,Vente,10059,,,LAS PAUSOS,B048,11300,11364,Saint-Polycarpe,11,,,113640000B0669,,,,,,,,,,,,,0,,,,,L,landes,,,8320,2.303084,43.03583
2019-111825,2019-07-08,000001,Vente,10059,,,LAS PAUSOS,B048,11300,11364,Saint-Polycarpe,11,,,113640000B0670,,,,,,,,,,,,,0,,,,,T,terres,,,2080,2.303063,43.036298
2019-111825,2019-07-08,000001,Vente,10059,,,LAS PAUSOS,B048,11300,11364,Saint-Polycarpe,11,,,113640000B0671,,,,,,,,,,,,,0,,,,,L,landes,,,3010,2.302287,43.036071
2019-111825,2019-07-08,000001,Vente,10059,,,LAS PAUSOS,B048,11300,11364,Saint-Polycarpe,11,,,113640000B0672,,,,,,,,,,,,,0,,,,,T,terres,,,2600,2.301854,43.036617
2019-112685,2019-09-05,000001,Vente,95000,39,,LE VILLAGE,B094,11300,11364,Saint-Polycarpe,11,,,113640000B0116,,,,,,,,,,,,,0,1,Maison,90,5,S,sols,,,265,2.289514,43.041525
2019-113691,2019-10-22,000001,Vente,90000,3,,LE VILLAGE,B094,11300,11364,Saint-Polycarpe,11,,,113640000B0022,,,,,,,,,,,,,0,1,Maison,103,5,S,sols,,,172,2.288265,43.041253
