id_mutation,date_mutation,numero_disposition,nature_mutation,valeur_fonciere,adresse_numero,adresse_suffixe,adresse_nom_voie,adresse_code_voie,code_postal,code_commune,nom_commune,code_departement,ancien_code_commune,ancien_nom_commune,id_parcelle,ancien_id_parcelle,numero_volume,lot1_numero,lot1_surface_carrez,lot2_numero,lot2_surface_carrez,lot3_numero,lot3_surface_carrez,lot4_numero,lot4_surface_carrez,lot5_numero,lot5_surface_carrez,nombre_lots,code_type_local,type_local,surface_reelle_bati,nombre_pieces_principales,code_nature_culture,nature_culture,code_nature_culture_speciale,nature_culture_speciale,surface_terrain,longitude,latitude
2019-168395,2019-01-04,000001,Vente,162184.16,123,,CAMP BLANC,B024,13370,13053,Mallemort,13,,,130530000C4716,,,,,,,,,,,,,0,1,Maison,52,4,S,sols,,,89,5.212508,43.709452
2019-168416,2019-01-11,000001,Vente,269000,23,,HAM DES AMANDIERS,0023,13370,13053,Mallemort,13,,,130530000C5042,,,,,,,,,,,,,0,1,Maison,67,3,S,sols,,,118,5.216834,43.704391
2019-168476,2019-01-22,000001,Vente,167000,13,,GR GRAND RUE,0155,13370,13053,Mallemort,13,,,130530000G0919,,,,,,,,,,,,,0,1,Maison,72,2,S,sols,,,45,5.180689,43.731111
2019-168476,2019-01-22,000001,Vente,167000,15,B,GR GRAND RUE,0155,13370,13053,Mallemort,13,,,130530000G0921,,,,,,,,,,,,,0,3,Dépendance,,0,S,sols,,,8,5.180775,43.731043
2019-168575,2019-01-22,000001,Vente,62800,9003,,LES HAUTS DU VILLAGE,A048,13370,13053,Mallemort,13,,,130530000C3341,,,951,,,,,,,,,,1,3,Dépendance,,0,,,,,,5.210927,43.708573
2019-168575,2019-01-22,000001,Vente,62800,5200,,LA TREVARESSE,A045,13370,13053,Mallemort,13,,,130530000C3797,,,118,,,,,,,,,,1,2,Appartement,27,2,,,,,,5.211971,43.70874
2019-168604,2019-02-08,000001,Vente,130139,9003,,LES HAUTS DU VILLAGE,A048,13370,13053,Mallemort,13,,,130530000C3341,,,1003,,,,,,,,,,1,3,Dépendance,,0,,,,,,5.210927,43.708573
2019-168604,2019-02-08,000001,Vente,130139,5200,,LA TREVARESSE,A045,13370,13053,Mallemort,13,,,130530000C3797,,,173,43.47,,,,,,,,,1,2,Appartement,44,3,,,,,,5.211971,43.70874
2019-168631,2019-01-28,000001,Vente,130000,,,LA VERDIERE,B174,13370,13053,Mallemort,13,,,130530000F1344,,,,,,,,,,,,,0,,,,,VE,vergers,,,307,5.171221,43.732477
2019-168631,2019-01-28,000001,Vente,130000,,,LA VERDIERE,B174,13370,13053,Mallemort,13,,,130530000F1677,,,,,,,,,,,,,0,,,,,T,terres,,,1193,5.171244,43.732614
2019-168679,2019-02-13,000002,Vente,1000,,,LA CRAU,B043,13370,13053,Mallemort,13,,,130530000F1648,,,,,,,,,,,,,0,,,,,VE,vergers,,,532,5.131273,43.732014
2019-168679,2019-02-13,000002,Vente,1000,,,LA CRAU,B043,13370,13053,Mallemort,13,,,130530000F1650,,,,,,,,,,,,,0,,,,,S,sols,,,44,5.131368,43.731912
2019-168687,2019-01-30,000001,Vente,270050,55,,GR GRAND RUE,0155,13370,13053,Mallemort,13,,,130530000G0104,,,,,,,,,,,,,0,1,Maison,145,6,S,sols,,,135,5.180901,43.730284
2019-168687,2019-01-30,000001,Vente,270050,,,LE VILLAGE,B192,13370,13053,Mallemort,13,,,130530000G0843,,,,,,,,,,,,,0,,,,,J,jardins,POTAG,Jardin potager,168,5.180539,43.730212
2019-168721,2019-01-28,000001,Vente,132400,9001,F,LES HAUTS DU VILLAGE,A048,13370,13053,Mallemort,13,,,130530000C3341,,,551,,,,,,,,,,1,3,Dépendance,,0,,,,,,5.210927,43.708573
2019-168721,2019-01-28,000001,Vente,132400,9001,F,LES HAUTS DU VILLAGE,A048,13370,13053,Mallemort,13,,,130530000C3341,,,531,61.15,,,,,,,,,1,2,Appartement,61,3,,,,,,5.210927,43.708573
2019-168726,2019-02-19,000001,Vente,150950,9001,F,LES HAUTS DU VILLAGE,A048,13370,13053,Mallemort,13,,,130530000C3341,,,766,,,,,,,,,,1,3,Dépendance,,0,,,,,,5.210927,43.708573
2019-168726,2019-02-19,000001,Vente,150950,9001,F,PONT ROYAL GREEN,A058,13370,13053,Mallemort,13,,,130530000C3826,,,21,34.23,,,,,,,,,1,2,Appartement,34,2,,,,,,5.209321,43.70823
2019-168768,2019-02-05,000001,Vente,243500,26,,AV CHARLES DE GAULLE,0366,13370,13053,Mallemort,13,,,130530000D1120,,,,,,,,,,,,,0,1,Maison,90,3,S,sols,,,554,5.178303,43.726981
2019-168791,2019-02-04,000001,Vente,86341.24,9001,F,HAUTS DU VILLAGE AIGUIER,A046,13370,13053,Mallemort,13,,,130530000C3341,,,885,,,,,,,,,,1,3,Dépendance,,0,,,,,,5.210927,43.708573
2019-168791,2019-02-04,000001,Vente,86341.24,9001,F,PONT ROYAL LES ALPILLES,A054,13370,13053,Mallemort,13,,,130530000C4143,,,31,,,,,,,,,,1,2,Appartement,32,2,,,,,,5.209665,43.70946
2019-168792,2019-02-14,000001,Vente,411700,23,,RUE DE LA PETITE COLLINE,0266,13370,13053,Mallemort,13,,,130530000C4817,,,,,,,,,,,,,0,1,Maison,140,6,S,sols,,,650,5.214204,43.706582
2019-168793,2019-02-15,000001,Vente,125185,9001,F,LES HAUTS DU VILLAGE,A048,13370,13053,Mallemort,13,,,130530000C3341,,,911,,,,,,,,,,1,3,Dépendance,,0,,,,,,5.210927,43.708573
2019-168793,2019-02-15,000001,Vente,125185,5200,,LA TREVARESSE,A045,13370,13053,Mallemort,13,,,130530000C3797,,,104,,,,,,,,,,1,2,Appartement,45,3,,,,,,5.211971,43.70874
2019-168843,2019-02-11,000001,Vente,147000,7,,PL RAOUL COUSTET,0285,13370,13053,Mallemort,13,,,130530000G1280,,,7,76.51,,,,,,,,,1,2,Appartement,76,3,,,,,,5.178221,43.729078
2019-168861,2019-02-28,000001,Vente,233000,9001,,LES COLLINES DU GOLF II,0151,13370,13053,Mallemort,13,,,130530000C5464,,,13,,,,,,,,,,1,3,Dépendance,,0,,,,,,5.216516,43.706264
2019-168861,2019-02-28,000001,Vente,233000,9001,,LES COLLINES DU GOLF II,0151,13370,13053,Mallemort,13,,,130530000C5464,,,20,69.33,,,,,,,,,1,1,Maison,69,4,,,,,,5.216516,43.706264
2019-168886,2019-02-22,000001,Vente,114341.3,9001,F,HAUTS DU VILLAGE AIGUIER,A046,13370,13053,Mallemort,13,,,130530000C3341,,,105,,,,,,,,,,1,2,Appartement,41,2,,,,,,5.210927,43.708573
2019-168886,2019-02-22,000001,Vente,114341.3,9001,F,HAUTS DU VILLAGE AIGUIER,A046,13370,13053,Mallemort,13,,,130530000C3341,,,878,,,,,,,,,,1,3,Dépendance,,0,,,,,,5.210927,43.708573
2019-168895,2019-02-26,000001,Vente,130641.5,9001,F,PONT ROYAL LE VERNEGUES,A056,13370,13053,Mallemort,13,,,130530000C3337,,,2,,,,,,,,,,1,3,Dépendance,,0,,,,,,5.209779,43.708511
2019-168895,2019-02-26,000001,Vente,130641.5,9001,F,PONT ROYAL LE VERNEGUES,A056,13370,13053,Mallemort,13,,,130530000C3337,,,20,48.81,,,,,,,,,1,2,Appartement,48,2,,,,,,5.209779,43.708511
2019-168896,2019-02-15,000001,Vente,402000,15,,LOT L ESPIGAU,A008,13370,13053,Mallemort,13,,,130530000D0960,,,,,,,,,,,,,0,1,Maison,120,4,S,sols,,,703,5.178098,43.723502
2019-168912,2019-02-22,000001,Vente,209000,18,,LES JARDINS D ALLEINS OUES,B082,13370,13053,Mallemort,13,,,130530000C1319,,,1,,,,,,,,,,1,2,Appartement,115,4,,,,,,5.187691,43.713898
2019-168931,2019-03-01,000001,Vente,580000,5080,B,BELLES PLAINES,B006,13370,13053,Mallemort,13,,,130530000B0788,,,,,,,,,,,,,0,1,Maison,120,4,S,sols,,,1328,5.222355,43.730544
2019-168931,2019-03-01,000001,Vente,580000,5080,B,BELLES PLAINES,B006,13370,13053,Mallemort,13,,,130530000B0788,,,,,,,,,,,,,0,1,Maison,60,2,T,terres,,,2129,5.222355,43.730544
2019-168931,2019-03-01,000001,Vente,580000,5080,B,BELLES PLAINES,B006,13370,13053,Mallemort,13,,,130530000B0788,,,,,,,,,,,,,0,1,Maison,120,4,T,terres,,,2129,5.222355,43.730544
2019-168931,2019-03-01,000001,Vente,580000,5080,B,BELLES PLAINES,B006,13370,13053,Mallemort,13,,,130530000B0788,,,,,,,,,,,,,0,1,Maison,60,2,T,terres,,,854,5.222355,43.730544
2019-168931,2019-03-01,000001,Vente,580000,5080,B,BELLES PLAINES,B006,13370,13053,Mallemort,13,,,130530000B0788,,,,,,,,,,,,,0,1,Maison,120,4,T,terres,,,854,5.222355,43.730544
2019-168931,2019-03-01,000001,Vente,580000,5080,B,BELLES PLAINES,B006,13370,13053,Mallemort,13,,,130530000B0788,,,,,,,,,,,,,0,1,Maison,60,2,T,terres,,,3116,5.222355,43.730544
2019-168931,2019-03-01,000001,Vente,580000,5080,B,BELLES PLAINES,B006,13370,13053,Mallemort,13,,,130530000B0788,,,,,,,,,,,,,0,1,Maison,120,4,T,terres,,,3116,5.222355,43.730544
2019-168931,2019-03-01,000001,Vente,580000,5080,B,BELLES PLAINES,B006,13370,13053,Mallemort,13,,,130530000B0788,,,,,,,,,,,,,0,1,Maison,60,2,S,sols,,,1328,5.222355,43.730544
2019-168951,2019-02-26,000001,Vente,125000,,,LA CONFRERIE,B038,13370,13053,Mallemort,13,,,130530000D1109,,,,,,,,,,,,,0,,,,,T,terres,,,448,5.181162,43.722741
2019-168956,2019-02-27,000001,Vente,150000,9999,F,RUE DES TROIS COLLINES,0356,13370,13053,Mallemort,13,,,130530000C5150,,,105,,130,44.39,,,,,,,2,2,Appartement,45,2,,,,,,5.21718,43.704879
2019-168956,2019-02-27,000001,Vente,150000,9999,F,RUE DES TROIS COLLINES,0356,13370,13053,Mallemort,13,,,130530000C5150,,,176,,,,,,,,,,1,3,Dépendance,,0,,,,,,5.21718,43.704879
2019-169040,2019-03-12,000001,Vente,144700,5,,RUE DES FRERES ARRUE,0135,13370,13053,Mallemort,13,,,130530000G0602,,,2,78.15,,,,,,,,,1,2,Appartement,80,3,,,,,,5.180838,43.732011
2019-169059,2019-03-08,000001,Vente,770000,16,,ALL DU GOLF,0148,13370,13053,Mallemort,13,,,130530000C3315,,,,,,,,,,,,,0,1,Maison,186,5,S,sols,,,803,5.206408,43.708934
2019-169059,2019-03-08,000001,Vente,770000,,,CAMP BLANC,B024,13370,13053,Mallemort,13,,,130530000C3327,,,,,,,,,,,,,0,,,,,AG,terrains d'agrément,,,362,5.206581,43.709121
2019-169059,2019-03-08,000001,Vente,770000,,,CAMP BLANC,B024,13370,13053,Mallemort,13,,,130530000C3379,,,,,,,,,,,,,0,,,,,AG,terrains d'agrément,,,40,5.206437,43.709106
2019-169059,2019-03-08,000001,Vente,770000,,,MOULIN DE VERNEGUES,B106,13370,13053,Mallemort,13,,,130530000C3394,,,,,,,,,,,,,0,,,,,AG,terrains d'agrément,,,120,5.206501,43.709045
2019-169060,2019-03-20,000001,Vente,262300,2,,RUE FERNAND PAURIOL,0120,13370,13053,Mallemort,13,,,130530000G0276,,,,,,,,,,,,,0,4,Local industriel. commercial ou assimilé,49,0,S,sols,,,125,5.179523,43.73098
2019-169060,2019-03-20,000001,Vente,262300,2,,RUE FERNAND PAURIOL,0120,13370,13053,Mallemort,13,,,130530000G0276,,,,,,,,,,,,,0,2,Appartement,115,4,S,sols,,,125,5.179523,43.73098
2019-169085,2019-03-08,000001,Vente,347000,5026,,CHEMIN DE SENAS,B035,13370,13053,Mallemort,13,,,130530000A0296,,,,,,,,,,,,,0,1,Maison,105,4,S,sols,,,1148,5.150607,43.737167
2019-169085,2019-03-08,000001,Vente,347000,5026,,CHEMIN DE SENAS,B035,13370,13053,Mallemort,13,,,130530000A0296,,,,,,,,,,,,,0,1,Maison,105,4,P,prés,,,1864,5.150607,43.737167
2019-169089,2019-03-22,000001,Vente,7409,,,LES FUMADES,B061,13370,13053,Mallemort,13,,,130530000C0806,,,,,,,,,,,,,0,,,,,T,terres,,,5030,5.217979,43.716114
2019-169112,2019-03-05,000002,Vente terrain à bâtir,137000,,,MOULIN DE VERNEGUES,B106,13370,13053,Mallemort,13,,,130530000C6011,,,,,,,,,,,,,0,,,,,B,bois,,,1138,5.209368,43.699896
2019-169112,2019-03-05,000002,Vente terrain à bâtir,137000,,,MOULIN DE VERNEGUES,B106,13370,13053,Mallemort,13,,,130530000C6012,,,,,,,,,,,,,0,,,,,B,bois,,,127,5.209099,43.700074
2019-169125,2019-03-19,000001,Vente,273800,5003,,PONT ROYAL,B134,13370,13053,Mallemort,13,,,130530000C3335,,,17,,3,101.07,31,,,,,,3,1,Maison,102,5,,,,,,5.208783,43.709163
2019-169138,2019-03-01,000001,Vente,171000,10,,RUE DES FRERES ARRUE,0135,13370,13053,Mallemort,13,,,130530000G0581,,,,,,,,,,,,,0,1,Maison,45,2,S,sols,,,52,5.181262,43.7319
2019-169138,2019-03-01,000001,Vente,171000,,,LE VILLAGE,B192,13370,13053,Mallemort,13,,,130530000G1304,,,,,,,,,,,,,0,,,,,S,sols,,,64,5.181197,43.731884
2019-169138,2019-03-01,000001,Vente,171000,,,LE VILLAGE,B192,13370,13053,Mallemort,13,,,130530000G1352,,,,,,,,,,,,,0,,,,,L,landes,,,6,5.18131,43.731944
2019-169138,2019-03-01,000001,Vente,171000,,,LE VILLAGE,B192,13370,13053,Mallemort,13,,,130530000G1355,,,,,,,,,,,,,0,,,,,S,sols,,,34,5.181292,43.731917
2019-169138,2019-03-01,000001,Vente,171000,,,LE VILLAGE,B192,13370,13053,Mallemort,13,,,130530000G1367,,,,,,,,,,,,,0,,,,,S,sols,,,1,5.181406,43.731838
2019-169138,2019-03-01,000001,Vente,171000,,,LE VILLAGE,B192,13370,13053,Mallemort,13,,,130530000G1368,,,,,,,,,,,,,0,,,,,S,sols,,,103,5.181322,43.731854
2019-169146,2019-03-25,000001,Vente,3500,,,LES PAISSES,B111,13370,13053,Mallemort,13,,,130530000B0520,,,,,,,,,,,,,0,,,,,P,prés,,,3142,5.237111,43.74084
2019-169162,2019-03-22,000001,Vente,5000,,,MARGUERY NORD,B098,13370,13053,Mallemort,13,,,130530000B0154,,,,,,,,,,,,,0,,,,,T,terres,,,3933,5.198604,43.731798
2019-169166,2019-03-25,000001,Vente,158000,1,,RUE CLASTRES,0090,13370,13053,Mallemort,13,,,130530000G0647,,,,,,,,,,,,,0,1,Maison,46,2,S,sols,,,51,5.18054,43.732167
2019-169166,2019-03-25,000001,Vente,158000,1,,RUE CLASTRES,0090,13370,13053,Mallemort,13,,,130530000G0744,,,,,,,,,,,,,0,1,Maison,90,4,S,sols,,,24,5.180582,43.732182
2019-169226,2019-03-21,000001,Vente,160184.16,133,,CAMP BLANC,B024,13370,13053,Mallemort,13,,,130530000C4721,,,,,,,,,,,,,0,1,Maison,52,4,S,sols,,,77,5.212784,43.709205
2019-169233,2019-03-26,000001,Vente,10000,,,CHEMIN DE LA BARQUE,B034,13370,13053,Mallemort,13,,,130530000B0704,,,,,,,,,,,,,0,,,,,T,terres,,,6653,5.221612,43.73457
2019-169241,2019-03-22,000001,Vente,124250,9003,,LES HAUTS DU VILLAGE,A048,13370,13053,Mallemort,13,,,130530000C3341,,,1007,,,,,,,,,,1,3,Dépendance,,0,,,,,,5.210927,43.708573
2019-169241,2019-03-22,000001,Vente,124250,9001,F,PONT ROYAL GREEN,A058,13370,13053,Mallemort,13,,,130530000C3826,,,16,,,,,,,,,,1,2,Appartement,34,2,,,,,,5.209321,43.70823
2019-169245,2019-04-05,000001,Vente,133000,4,,RUE PASCAL,0255,13370,13053,Mallemort,13,,,130530000G0336,,,,,,,,,,,,,0,1,Maison,65,1,S,sols,,,125,5.179918,43.731417
2019-169261,2019-03-22,000001,Vente,163000,42,,RUE FERNAND PAURIOL,0120,13370,13053,Mallemort,13,,,130530000G1392,,,3,83.22,,,,,,,,,1,2,Appartement,84,3,,,,,,5.178736,43.729617
2019-169287,2019-03-05,000001,Vente,120000,6,,RUE PASCAL,0255,13370,13053,Mallemort,13,,,130530000G0337,,,,,,,,,,,,,0,3,Dépendance,,0,S,sols,,,89,5.179954,43.731361
2019-169287,2019-03-05,000001,Vente,120000,7,,RUE PASCAL,0255,13370,13053,Mallemort,13,,,130530000G0344,,,,,,,,,,,,,0,1,Maison,50,2,S,sols,,,31,5.180175,43.731376
2019-169340,2019-03-29,000001,Vente,297942,5285,,LA CONFRERIE SUD,B039,13370,13053,Mallemort,13,,,130530000D0055,,,,,,,,,,,,,0,3,Dépendance,,0,S,sols,,,9,5.180764,43.720016
2019-169340,2019-03-29,000001,Vente,297942,,,LA CONFRERIE SUD,B039,13370,13053,Mallemort,13,,,130530000D0057,,,,,,,,,,,,,0,,,,,T,terres,,,538,,
2019-169340,2019-03-29,000001,Vente,297942,,,LA CONFRERIE SUD,B039,13370,13053,Mallemort,13,,,130530000D0413,,,,,,,,,,,,,0,,,,,VI,vignes,,,30,5.180425,43.719981
2019-169340,2019-03-29,000001,Vente,297942,5290,,LA CONFRERIE SUD,B039,13370,13053,Mallemort,13,,,130530000D0414,,,,,,,,,,,,,0,1,Maison,93,4,T,terres,,,3960,,
2019-169340,2019-03-29,000001,Vente,297942,5290,,LA CONFRERIE SUD,B039,13370,13053,Mallemort,13,,,130530000D0414,,,,,,,,,,,,,0,1,Maison,93,4,S,sols,,,120,,
2019-169341,2019-03-29,000001,Vente,2058,,,LA CONFRERIE,B038,13370,13053,Mallemort,13,,,130530000D0064,,,,,,,,,,,,,0,,,,,S,sols,,,462,,
2019-169341,2019-03-29,000001,Vente,2058,,,LA CONFRERIE,B038,13370,13053,Mallemort,13,,,130530000D0064,,,,,,,,,,,,,0,,,,,VE,vergers,,,1596,,
2019-169379,2019-04-20,000001,Vente,599800,1001,.,LES GARRIGUES,B064,,13053,Mallemort,13,,,130530000C4904,,,,,,,,,,,,,0,1,Maison,132,5,S,sols,,,848,5.216302,43.703621
2019-169379,2019-04-20,000001,Vente,599800,6143,,LES GARRIGUES,B064,13370,13053,Mallemort,13,,,130530000C4905,,,,,,,,,,,,,0,,,,,S,sols,,,50,5.216609,43.703376
2019-169383,2019-04-02,000001,Vente,300000,,,LE ROURE,B143,13370,13053,Mallemort,13,,,130530000E0139,,,,,,,,,,,,,0,,,,,S,sols,,,20,5.174082,43.726656
2019-169383,2019-04-02,000001,Vente,300000,,,LE ROURE,B143,13370,13053,Mallemort,13,,,130530000E1639,,,,,,,,,,,,,0,,,,,AB,terrains a bâtir,,,95,5.174767,43.727294
2019-169383,2019-04-02,000001,Vente,300000,,,LE ROURE,B143,13370,13053,Mallemort,13,,,130530000E1971,,,,,,,,,,,,,0,,,,,AB,terrains a bâtir,,,1972,5.174325,43.726996
2019-169386,2019-04-10,000001,Vente,750000,,,BELLES PLAINES,B006,13370,13053,Mallemort,13,,,130530000B0797,,,,,,,,,,,,,0,,,,,P,prés,,,22932,5.218294,43.734525
2019-169386,2019-04-10,000001,Vente,750000,5082,,BELLES PLAINES,B006,13370,13053,Mallemort,13,,,130530000B0798,,,,,,,,,,,,,0,1,Maison,540,10,S,sols,,,2534,5.217622,43.733997
2019-169386,2019-04-10,000001,Vente,750000,5082,,BELLES PLAINES,B006,13370,13053,Mallemort,13,,,130530000B0798,,,,,,,,,,,,,0,1,Maison,66,2,S,sols,,,2534,5.217622,43.733997
2019-169386,2019-04-10,000001,Vente,750000,,,BELLES PLAINES,B006,13370,13053,Mallemort,13,,,130530000B0799,,,,,,,,,,,,,0,,,,,VE,vergers,,,2666,5.216821,43.733892
2019-169386,2019-04-10,000001,Vente,750000,,,BELLES PLAINES,B006,13370,13053,Mallemort,13,,,130530000B0800,,,,,,,,,,,,,0,,,,,P,prés,,,2375,5.217968,43.733875
2019-169386,2019-04-10,000001,Vente,750000,,,BELLES PLAINES,B006,13370,13053,Mallemort,13,,,130530000B1622,,,,,,,,,,,,,0,,,,,T,terres,,,5170,5.21752,43.733484
2019-169459,2019-04-25,000001,Vente,856000,2,B,RUE DES VALLONS,0362,13370,13053,Mallemort,13,,,130530000C4383,,,,,,,,,,,,,0,1,Maison,299,6,S,sols,,,511,5.211482,43.703391
2019-169459,2019-04-25,000001,Vente,856000,,,MOULIN DE VERNEGUES,B106,13370,13053,Mallemort,13,,,130530000C4386,,,,,,,,,,,,,0,,,,,B,bois,,,1746,5.21165,43.703145
2019-169459,2019-04-25,000001,Vente,856000,,,MOULIN DE VERNEGUES,B106,13370,13053,Mallemort,13,,,130530000C4392,,,,,,,,,,,,,0,,,,,B,bois,,,336,5.211901,43.703389
2019-169459,2019-04-25,000001,Vente,856000,,,MOULIN DE VERNEGUES,B106,13370,13053,Mallemort,13,,,130530000C4393,,,,,,,,,,,,,0,,,,,B,bois,,,56,5.211754,43.702812
2019-169459,2019-04-25,000001,Vente,856000,,,MOULIN DE VERNEGUES,B106,13370,13053,Mallemort,13,,,130530000C4411,,,,,,,,,,,,,0,,,,,VE,vergers,,,91,5.211721,43.702499
2019-169459,2019-04-25,000001,Vente,856000,,,MOULIN DE VERNEGUES,B106,13370,13053,Mallemort,13,,,130530000C4417,,,,,,,,,,,,,0,,,,,VE,vergers,,,57,5.211702,43.702552
2019-169459,2019-04-25,000001,Vente,856000,,,MOULIN DE VERNEGUES,B106,13370,13053,Mallemort,13,,,130530000C4421,,,,,,,,,,,,,0,,,,,VE,vergers,,,20,5.211705,43.702658
2019-169459,2019-04-25,000001,Vente,856000,,,MOULIN DE VERNEGUES,B106,13370,13053,Mallemort,13,,,130530000C4423,,,,,,,,,,,,,0,,,,,VE,vergers,,,6,5.211737,43.702646
2019-169459,2019-04-25,000001,Vente,856000,,,MOULIN DE VERNEGUES,B106,13370,13053,Mallemort,13,,,130530000C4427,,,,,,,,,,,,,0,,,,,L,landes,,,8,5.211679,43.70243
2019-169459,2019-04-25,000001,Vente,856000,,,MOULIN DE VERNEGUES,B106,13370,13053,Mallemort,13,,,130530000C4429,,,,,,,,,,,,,0,,,,,L,landes,,,12,5.21171,43.702388
2019-169459,2019-04-25,000001,Vente,856000,,,MOULIN DE VERNEGUES,B106,13370,13053,Mallemort,13,,,130530000C4433,,,,,,,,,,,,,0,,,,,VE,vergers,,,24,5.211672,43.702361
2019-169459,2019-04-25,000001,Vente,856000,,,MOULIN DE VERNEGUES,B106,13370,13053,Mallemort,13,,,130530000C4436,,,,,,,,,,,,,0,,,,,VE,vergers,,,30,5.211709,43.702312
2019-169462,2019-04-19,000001,Vente,293450,5001,,PONT ROYAL,B134,13370,13053,Mallemort,13,,,130530000C3340,,,16,,,,,,,,,,1,3,Dépendance,,0,,,,,,5.211238,43.708224
2019-169462,2019-04-19,000001,Vente,293450,5001,,PONT ROYAL,B134,13370,13053,Mallemort,13,,,130530000C3340,,,28,,,,,,,,,,1,3,Dépendance,,0,,,,,,5.211238,43.708224
2019-169462,2019-04-19,000001,Vente,293450,5001,,PONT ROYAL,B134,13370,13053,Mallemort,13,,,130530000C3340,,,21,87.33,,,,,,,,,1,2,Appartement,76,3,,,,,,5.211238,43.708224
2019-169462,2019-04-19,000001,Vente,293450,5001,,PONT ROYAL,B134,13370,13053,Mallemort,13,,,130530000C3340,,,8,,,,,,,,,,1,3,Dépendance,,0,,,,,,5.211238,43.708224
2019-169464,2019-04-17,000001,Vente,130000,,,LA FARRAGE,B058,13370,13053,Mallemort,13,,,130530000E2086,,,,,,,,,,,,,0,,,,,AB,terrains a bâtir,,,340,5.171886,43.729188
2019-169472,2019-04-10,000001,Vente,395000,5001,B,PONT ROYAL,B134,13370,13053,Mallemort,13,,,130530000C3476,,,1,125.14,,,,,,,,,1,1,Maison,134,5,,,,,,5.206951,43.706123
2019-169472,2019-04-10,000001,Vente,395000,5001,B,PONT ROYAL,B134,13370,13053,Mallemort,13,,,130530000C3476,,,7,,,,,,,,,,1,3,Dépendance,,0,,,,,,5.206951,43.706123
2019-169472,2019-04-10,000001,Vente,395000,,,CAMP BLANC,B024,13370,13053,Mallemort,13,,,130530000C3490,,,,,,,,,,,,,0,,,,,S,sols,,,5,5.20666,43.706339
2019-169508,2019-04-25,000001,Vente,86341,9003,,LES HAUTS DU VILLAGE,A048,13370,13053,Mallemort,13,,,130530000C3341,,,813,,,,,,,,,,1,3,Dépendance,,0,,,,,,5.210927,43.708573
2019-169508,2019-04-25,000001,Vente,86341,9001,F,PONT ROYAL LES ALPILLES,A054,13370,13053,Mallemort,13,,,130530000C4143,,,26,,,,,,,,,,1,2,Appartement,27,2,,,,,,5.209665,43.70946
2019-169572,2019-02-05,000001,Vente,192000,20,,GR GRAND RUE,0155,13370,13053,Mallemort,13,,,130530000G0123,,,,,,,,,,,,,0,1,Maison,25,1,S,sols,,,54,5.180426,43.731192
2019-169572,2019-02-05,000001,Vente,192000,20,,GR GRAND RUE,0155,13370,13053,Mallemort,13,,,130530000G0123,,,,,,,,,,,,,0,1,Maison,74,3,S,sols,,,54,5.180426,43.731192
2019-169572,2019-02-05,000001,Vente,192000,,,LE VILLAGE,B192,13370,13053,Mallemort,13,,,130530000G0992,,,,,,,,,,,,,0,,,,,S,sols,,,20,5.180361,43.731169
2019-169573,2019-04-24,000001,Vente,150000,,,LES VICAIRES,B191,13370,13053,Mallemort,13,,,130530000C0403,,,,,,,,,,,,,0,,,,,T,terres,,,4572,5.207775,43.729949
2019-169573,2019-04-24,000001,Vente,150000,,,LES VICAIRES,B191,13370,13053,Mallemort,13,,,130530000C0405,,,,,,,,,,,,,0,,,,,VE,vergers,,,685,5.208039,43.729556
2019-169573,2019-04-24,000001,Vente,150000,,,LES VICAIRES,B191,13370,13053,Mallemort,13,,,130530000C0406,,,,,,,,,,,,,0,,,,,P,prés,,,619,5.208139,43.729547
2019-169573,2019-04-24,000001,Vente,150000,5162,,LES VICAIRES,B191,13370,13053,Mallemort,13,,,130530000C2043,,,,,,,,,,,,,0,1,Maison,90,3,S,sols,,,795,5.208085,43.730139
2019-169575,2019-04-24,000001,Vente,60000,,,LES VICAIRES,B191,13370,13053,Mallemort,13,,,130530000C2042,,,,,,,,,,,,,0,,,,,S,sols,,,577,5.208073,43.730312
2019-169586,2019-05-03,000001,Echange,1000,14,,PONT ROYAL NORD,B138,13370,13053,Mallemort,13,,,130530000C6008,,,,,,,,,,,,,0,,,,,S,sols,,,7,,
2019-169586,2019-05-03,000002,Echange,1000,,,PONT ROYAL NORD,B138,13370,13053,Mallemort,13,,,130530000C6005,,,,,,,,,,,,,0,,,,,S,sols,,,7,5.187333,43.714192
2019-169587,2019-05-03,000001,Vente,180000,14,,PONT ROYAL NORD,B138,13370,13053,Mallemort,13,,,130530000C6007,,,,,,,,,,,,,0,1,Maison,68,3,S,sols,,,396,5.187122,43.714093
2019-169588,2019-04-17,000001,Vente,140000,,,LA FARRAGE,B058,13370,13053,Mallemort,13,,,130530000E2091,,,,,,,,,,,,,0,,,,,AB,terrains a bâtir,,,432,5.172041,43.728782
2019-169637,2019-05-03,000001,Vente,1,5017,,LE COUP PERDU,B041,13370,13053,Mallemort,13,,,130530000A0060,,,,,,,,,,,,,0,1,Maison,93,3,S,sols,,,2223,5.172723,43.737013
2019-169654,2019-04-23,000001,Vente,221200,5001,B,PONT ROYAL,B134,13370,13053,Mallemort,13,,,130530000C3476,,,2,75.52,,,,,,,,,1,1,Maison,73,3,,,,,,5.206951,43.706123
2019-169654,2019-04-23,000001,Vente,221200,5001,B,PONT ROYAL,B134,13370,13053,Mallemort,13,,,130530000C3476,,,6,,,,,,,,,,1,3,Dépendance,,0,,,,,,5.206951,43.706123
2019-169662,2019-05-06,000001,Vente,405000,,,LA VERDIERE,B174,13370,13053,Mallemort,13,,,130530000F1144,,,,,,,,,,,,,0,,,,,T,terres,,,155,5.170896,43.732502
2019-169662,2019-05-06,000001,Vente,405000,,,LA VERDIERE,B174,13370,13053,Mallemort,13,,,130530000F1146,,,,,,,,,,,,,0,,,,,VE,vergers,,,148,5.170925,43.732422
2019-169662,2019-05-06,000001,Vente,405000,,,LA VERDIERE,B174,13370,13053,Mallemort,13,,,130530000F1508,,,,,,,,,,,,,0,,,,,AB,terrains a bâtir,,,268,5.17064,43.732322
2019-169662,2019-05-06,000001,Vente,405000,9010,,AV DE CRAPONNE,0105,13370,13053,Mallemort,13,,,130530000F1589,,,,,,,,,,,,,0,1,Maison,125,3,S,sols,,,772,5.170779,43.732535
2019-169671,2019-05-13,000001,Vente,12500,9999,F,RUE DES TROIS COLLINES,0356,13370,13053,Mallemort,13,,,130530000C5150,,,211,,,,,,,,,,1,3,Dépendance,,0,,,,,,5.21718,43.704879
2019-169765,2019-05-03,000001,Vente,549500,68,,LES GARRIGUES,B064,13370,13053,Mallemort,13,,,130530000C4639,,,,,,,,,,,,,0,1,Maison,109,5,S,sols,,,607,5.215023,43.70539
2019-169765,2019-05-03,000001,Vente,549500,,,LES GARRIGUES,B064,13370,13053,Mallemort,13,,,130530000C5960,,,,,,,,,,,,,0,,,,,S,sols,,,120,5.215314,43.705457
2019-169800,2019-05-13,000001,Vente,13800,9999,F,RUE DES TROIS COLLINES,0356,13370,13053,Mallemort,13,,,130530000C5150,,,204,,,,,,,,,,1,3,Dépendance,,0,,,,,,5.21718,43.704879
2019-169802,2019-05-16,000001,Vente terrain à bâtir,153000,,,MOULIN DE VERNEGUES,B106,13370,13053,Mallemort,13,,,130530000C6010,,,,,,,,,,,,,0,,,,,B,bois,,,1295,5.20917,43.699724